program: Gaussian 09
title: 000048910
version: EM64L-G09RevD.01
frameworkgroup: C1[X(C17H28N2O2)]
method: RPBEPBE
basis: SDD
operation: Freq
keyword: #p
keyword: freq=noraman
keyword: PBEPBE/SDD
title: #p freq=noraman PBEPBE/SDD
converged: YES YES NO NO
title: Mulliken charges:
elementType: O O N N C C C C C C C C C C C C C C C C C H H H H H H H H H H H H H H H H H H H H H H H H H H H H
charge: -0.274868 -0.278074 -0.330931 -0.693660 -0.416798 -0.015214 -0.377761 -0.372628 -0.351890 -0.769076 -0.353780 -0.379614 -0.316238 -0.716225 0.184036 0.236314 -0.344933 -0.323389 -0.409437 -0.408492 0.515262 0.195407 0.201596 0.185384 0.194079 0.235881 0.178754 0.192619 0.206600 0.179172 0.248731 0.217503 0.205328 0.239879 0.189809 0.198522 0.190909 0.259606 0.213894 0.224792 0.224907 0.207399 0.208236 0.265277 0.269786 0.221479 0.221393 0.309927 0.310530
chargesum: 0.00000
title: Mulliken charges with hydrogens summed into heavy atoms:
elementType: O O N N C C C C C C C C C C C C C C C C C
charge: -0.274868 -0.278074 -0.082200 -0.073202 -0.019796 0.170171 0.052200 -0.001255 0.033881 -0.106367 0.034552 0.070901 0.122447 -0.075683 0.184036 0.236314 -0.079656 -0.053603 -0.187959 -0.187099 0.515262
polarizability: 2.80584603e+02 2.55296253e+01 1.67526791e+02 7.53292425e+00 1.05191693e+01 1.80678121e+02
1716.lowfreq: -5.7163 -5.6045 -0.0005 -0.0004 0.0003 8.0123 20.2967 24.8196 30.0622
frequency: 19.8737 24.6116 29.9194 42.7869 55.0587 65.4517 72.6112 81.5166 104.4421 113.0819 119.9969 128.0614 147.8151 174.9577 181.1525 201.5228 229.6713 233.3497 245.5415 263.5444 290.6792 300.3081 333.6231 363.6980 371.6376 383.0265 409.5381 410.5851 411.7934 416.3401 444.7450 470.0769 503.8552 519.0593 563.6843 609.7992 628.9692 633.3955 678.0020 726.7605 739.9535 744.1167 755.8284 787.2105 809.1455 817.6842 826.0950 840.1064 845.2838 872.9755 883.9543 898.9393 949.7358 969.0674 974.4344 975.3086 983.9324 987.6475 1002.1549 1011.0190 1018.1734 1030.2681 1059.2312 1062.2551 1071.1926 1077.5438 1086.1092 1121.3137 1129.5863 1135.0194 1168.0478 1178.4599 1187.9900 1198.7305 1217.9072 1235.6760 1247.6756 1257.9715 1265.6599 1276.7328 1280.4679 1286.6852 1291.3836 1308.1311 1313.1000 1324.0046 1330.3125 1340.4462 1353.7669 1363.4283 1366.4220 1374.6571 1383.8176 1386.4099 1391.3543 1440.1445 1446.4348 1457.0776 1461.4492 1464.5061 1466.3491 1475.4559 1477.1254 1477.6547 1482.6197 1485.3838 1486.9024 1490.5540 1516.5792 1569.8527 1608.5433 1630.9770 1645.7607 2828.8141 2835.8002 2945.2683 2952.1138 2963.5301 2964.3200 2966.5501 2969.6917 2977.0259 2986.4453 3000.3187 3008.1271 3017.1624 3026.2647 3043.9815 3061.5199 3062.0425 3064.6255 3066.1806 3089.9638 3091.6483 3123.2559 3126.1753 3158.2447 3175.5579 3443.7394 3559.9004 3699.6239
redmass: 4.2535 5.1723 4.8758 4.4766 2.7634 2.1250 2.9349 3.1803 4.4774 3.2095 3.1446 2.0503 2.4494 2.8978 3.3616 2.4442 1.1360 1.1228 3.6976 2.8570 4.8732 5.1607 2.6803 3.1788 2.9867 2.5336 1.9070 1.4710 1.5385 1.4965 2.8141 4.7252 2.9600 2.8443 1.5974 4.9147 2.3597 6.8961 4.0134 1.0654 1.1209 4.8499 4.5687 1.2243 2.4952 4.6536 1.2659 3.3773 1.8693 1.2781 1.8766 1.9319 1.8434 1.3516 1.3808 1.9487 1.3504 2.6702 2.7644 3.1392 1.4893 1.6120 4.5555 2.4795 2.0248 2.2485 1.8802 2.3991 1.2253 2.5790 2.1329 1.3009 1.7375 1.5778 1.2523 1.2788 1.2943 3.0398 1.1467 1.1167 1.3608 1.1243 1.0930 1.3198 1.4385 2.9425 1.3501 1.4422 1.6603 1.4395 1.3143 1.3861 1.2575 1.2177 4.8024 1.1374 4.1792 1.1256 1.1109 1.0713 1.0740 1.0632 1.0711 1.0825 1.0805 1.0630 1.0764 1.0918 3.1566 7.2228 9.1217 3.4938 1.3889 1.0790 1.0744 1.0593 1.0597 1.0564 1.0589 1.0407 1.0635 1.0377 1.0931 1.0988 1.0992 1.0577 1.1040 1.1035 1.0871 1.0992 1.1007 1.0976 1.0998 1.1054 1.0893 1.0895 1.0953 1.0947 1.0747 1.0451 1.1040
irintensity: 0.5633 1.1700 0.9829 0.2865 0.7467 0.6375 0.7399 0.1857 0.5654 2.5021 0.5360 0.1786 0.3122 1.1072 3.1103 2.4923 1.4980 0.1667 0.5753 0.5862 8.3379 5.5161 4.9603 2.4452 6.8113 4.8062 80.0386 248.6288 31.3422 2.0464 2.6815 4.1950 6.4449 3.0010 60.1337 20.4355 14.2954 1.6709 33.5427 15.1929 0.3663 8.5746 17.4463 2.0039 2.9737 4.3397 1.7892 11.6543 75.2078 0.6486 2.7621 4.1604 5.9674 0.7662 0.4389 4.0975 0.1964 4.1034 14.9755 0.7295 8.1372 9.2687 286.8055 5.4288 12.3676 4.5194 0.5641 23.6321 12.3501 12.4048 34.7527 156.6611 22.4379 5.9809 15.8108 36.4009 1.8606 260.1522 1.0181 7.9570 9.7408 0.1820 2.5004 1.5817 3.2222 91.9162 29.0286 8.2986 1.8561 1.1128 15.4363 6.9647 26.4061 10.3401 11.5641 36.8584 4.6920 18.0963 0.7162 0.5390 0.8404 4.5134 6.2489 5.6065 2.6021 8.7604 8.5018 26.6420 64.1761 29.4578 300.5719 98.5137 282.6123 39.3749 227.8454 9.0142 8.5889 49.2106 4.3941 28.5940 99.1954 35.7094 11.7573 4.8780 19.0261 65.0149 15.7880 114.3148 7.3519 56.0383 91.8059 56.4270 33.7781 22.8817 14.0003 20.0278 7.5686 2.5716 2.1206 104.3764 22.6811
temp: 298.150 k
press: 1.00000 atm
elementType: 8 8 7 7 6 6 6 6 6 6 6 6 6 6 6 6 6 6 6 6 6 1 1 1 1 1 1 1 1 1 1 1 1 1 1 1 1 1 1 1 1 1 1 1 1 1 1 1 1
symmnumber: 1
zpe: 1113067.3 jmol-1
zpe.correction: 0.423945 hartree
zpe.thermalcorrener: 0.447780 hartree
zpe.thermalcorrenthalpy: 0.448724 hartree
zpe.thermalcorrgfe: 0.368635 hartree
zpe.sumelectzpe: -922.922788 hartree
zpe.sumelectthermal: -922.898953 hartree
zpe.sumelectthermalent: -922.898009 hartree
zpe.sumelectthermalfe: -922.978098 hartree
dipole: 2.0506 1.1343 2.5170
dipole: 3.4390
quadrupole: -91.8977 -136.1520 -127.6249
quadrupole: 1.5497 0.9474 -3.9455
quadrupole: 26.6605 -17.5938 -9.0667 1.5497 0.9474 -3.9455
hfenergy: -923.3467331 hartree
pointgroup: C01 [X(C17H28N2O2)]
dipole: -0.8171511 -0.4036577 0.9999968 debye
polarizability: 281.5499394|23.1566543|166.0402214|-8.164215|-9.928449|181.1993538 unknown
InChI: InChI=1S/C17H28N2O2/c1-3-4-5-6-7-14(2)19-12-13-21-17(20)15-8-10-16(18)11-9-15/h8-11,14,19H,3-7,12-13,18H2,1-2H3
charge 0 multiplicity 1
49 atoms
O  1.346263 2.144297 0.41894
O  0.786918 2.234798 -1.849125
N  3.528282 0.064294 0.606281
N  -4.858387 0.620841 0.971114
C  2.737497 -1.980101 -0.61466
C  3.898388 -1.308104 0.174678
C  1.420848 -2.140893 0.177734
C  0.227517 -2.536523 -0.721099
C  -1.097283 -2.6944 0.059163
C  4.297447 -2.123596 1.422716
C  -2.297634 -3.062887 -0.842206
C  3.463495 1.099201 -0.435903
C  2.764534 2.378437 0.049568
C  -3.622849 -3.196002 -0.059991
C  0.441473 2.044076 -0.650777
C  -0.921096 1.69484 -0.193459
C  -1.959629 1.592283 -1.159017
C  -1.226397 1.437966 1.171027
C  -3.263308 1.242207 -0.780801
C  -2.527638 1.087847 1.56085
C  -3.569885 0.98048 0.589921
H  3.095013 -2.968546 -0.971091
H  2.53065 -1.38637 -1.528753
H  4.784423 -1.285083 -0.512812
H  1.544889 -2.905984 0.971535
H  1.203002 -1.182911 0.688579
H  0.456429 -3.484686 -1.253667
H  0.093831 -1.762805 -1.506358
H  -1.319553 -1.746361 0.591112
H  -0.974222 -3.472871 0.842215
H  4.069791 0.369249 1.425559
H  4.515797 -3.17153 1.150984
H  5.202684 -1.701729 1.901041
H  3.4810 -2.118015 2.166307
H  -2.080144 -4.013812 -1.371208
H  -2.409201 -2.286796 -1.626945
H  4.47019 1.405412 -0.826013
H  2.904206 0.708145 -1.302087
H  3.215449 2.763402 0.980539
H  2.809355 3.147587 -0.743058
H  -3.881826 -2.241237 0.436169
H  -3.543628 -3.973719 0.723673
H  -4.461941 -3.472828 -0.725959
H  -1.715487 1.790537 -2.208201
H  -0.426668 1.51133 1.913237
H  -4.053688 1.164475 -1.537234
H  -2.749381 0.888387 2.616367
H  -5.083895 0.441009 1.945494
H  -5.601732 0.537388 0.283322
