program: Gaussian 09
title: 000048847
version: EM64L-G09RevD.01
frameworkgroup: C1[X(C9H9NO3)]
method: RPBEPBE
basis: SDD
operation: Freq
keyword: #pfreq=noraman
keyword: PBEPBE/SDD
title: #p freq=noraman PBEPBE/SDD
converged: YES YES NO NO
title: Mulliken charges:
elementType: O O O N C C C C C C C C C H H H H H H H H H
charge: -0.436177 -0.254813 -0.257642 -0.447479 0.511312 -0.579055 0.293821 -0.348785 -0.352670 -0.197426 0.217087 0.112197 -0.798382 0.263334 0.315114 0.275301 0.317243 0.233651 0.240565 0.270358 0.237541 0.384905
chargesum: 0.00000
title: Mulliken charges with hydrogens summed into heavy atoms:
elementType: O O O N C C C C C C C C C
charge: -0.051272 -0.254813 -0.257642 -0.130236 0.511312 -0.315720 0.293821 -0.033671 -0.077369 0.036224 0.217087 0.112197 -0.049919
polarizability: 1.79441276e+02 -5.01939003e-02 1.25867983e+02 2.72093508e-02 -1.72685274e-02 5.08051468e+01
1716.lowfreq: -78.9825 -11.2194 -8.4601 -0.7998 -0.0009 -0.0007 0.0006 52.4084 59.9483
frequency: -78.9743 52.3796 59.9363 92.1323 118.4818 161.3611 203.5598 254.2373 287.5199 334.9444 389.9708 422.8191 487.0088 515.3111 533.7440 579.4600 595.1484 607.9552 652.6158 654.3700 694.0753 733.7159 745.4768 828.3791 856.6640 925.8341 944.0996 950.7701 983.4039 990.9500 1009.8859 1030.9285 1050.5018 1093.1307 1139.6049 1184.4455 1220.8186 1254.0501 1309.9143 1329.4023 1374.4625 1386.2310 1418.2555 1450.9603 1467.2680 1477.7868 1520.8350 1593.3814 1618.5410 1636.3992 1642.0289 2988.5504 3073.7014 3128.9105 3137.9943 3147.2456 3184.5600 3195.4029 3523.2991 3533.3134
redmass: 1.0490 7.3369 7.2129 3.9205 5.5087 4.7469 6.5819 3.7356 6.2861 3.8859 7.9788 3.1303 5.7122 2.6159 4.7518 2.5682 4.6824 1.4446 5.7700 1.2509 2.4288 3.7962 5.8383 1.4674 4.3903 1.5997 5.5766 1.3840 3.2794 2.3644 1.3377 1.6717 2.5053 1.6506 1.4996 1.1113 3.1289 1.6807 1.5389 2.9533 1.2374 4.7829 3.4872 1.1473 1.0470 2.8231 2.0576 5.9259 6.3074 5.0959 8.3931 1.0384 1.0983 1.0919 1.0979 1.0893 1.0943 1.0961 1.0766 1.0641
irintensity: 0.0562 2.1626 10.6653 0.9846 6.3846 1.8850 3.0775 1.3280 0.9029 1.0848 10.1628 6.2840 21.7026 2.3020 11.2886 19.0855 42.6261 163.1482 2.7882 30.5403 2.0200 90.9209 1.8743 30.6497 10.6944 35.5566 4.7995 0.0192 9.5226 113.0309 3.2788 8.3702 224.8346 15.9545 109.7410 6.0443 34.2392 22.5975 77.0760 187.5822 44.3044 81.1346 7.9135 47.9480 20.2714 150.0330 336.6717 52.4701 35.0923 254.2171 127.9648 7.3258 14.3078 6.7580 6.6524 12.3515 2.6940 7.2398 13.8696 48.3538
temp: 298.150 k
press: 1.00000 atm
elementType: 8 8 8 7 6 6 6 6 6 6 6 6 6 1 1 1 1 1 1 1 1 1
symmnumber: 1
zpe: 435309.9 jmol-1
zpe.correction: 0.165801 hartree
zpe.thermalcorrener: 0.177141 hartree
zpe.thermalcorrenthalpy: 0.178085 hartree
zpe.thermalcorrgfe: 0.127554 hartree
zpe.sumelectzpe: -627.874434 hartree
zpe.sumelectthermal: -627.863093 hartree
zpe.sumelectthermalent: -627.862149 hartree
zpe.sumelectthermalfe: -627.912681 hartree
dipole: -0.1198 -1.7451 0.0111
dipole: 1.7492
quadrupole: -69.4224 -73.7889 -77.7157
quadrupole: -16.1321 0.0352 -0.0034
quadrupole: 4.2199 -0.1466 -4.0733 -16.1321 0.0352 -0.0034
hfenergy: -628.0402346 hartree
pointgroup: C01 [X(C9H9N1O3)]
dipole: -0.0632545 -0.6852811 0.004045 debye
dipolederiv: -1.2811011 0.345981 0.0007029 0.4546112 -0.4499021 -0.0002368 0.0011004 -0.000288 -0.4241599 -0.8886399 0.0056019 0.0002486 -0.5362884 -0.76562 0.0008132 -0.0019053 0.0010302 -0.3398846 -0.7741231 -0.2106002 -0.0000796 -0.2195611 -1.0443009 -0.0008506 0.0000328 -0.0005337 -0.3344704 -1.9373678 0.265668 -0.0001578 0.1935326 -0.3503371 -0.000722 0.0006262 0.0001085 -0.3314823 1.0053544 -0.4554335 -0.0010122 -0.8151594 0.1383589 0.0004404 -0.0020608 0.0006194 0.1084835 -0.1880894 0.2876172 0.0002732 -0.1137252 -0.0178611 0.0001709 0.0001073 0.0000439 -0.174753 -0.5057374 -0.3128843 -0.0001487 -0.304097 -0.0898413 0.000034 -0.0000693 -0.0000544 0.0217451 -0.1251033 0.0080997 -0.0001117 0.2435624 -0.0896129 0.0001299 -0.0003935 0.0001829 -0.1472455 -0.0402101 -0.0583783 -0.0001868 0.1868765 -0.0751828 0.0000107 0.0000877 0.000066 -0.1422565 -0.1090539 0.0456994 0.0000184 -0.025938 0.2223915 0.0003526 0.0000906 0.000298 -0.1409638 2.1096158 -0.1168369 0.0013393 0.5622346 0.9604088 -0.0025685 0.0085223 -0.0054774 0.1712387 2.0635323 0.1661006 -0.0005841 0.1765321 1.3659396 0.0013404 -0.0008512 0.0011752 0.2280384 -0.2497867 0.1769071 0.0009356 0.3138142 -0.2707644 0.0046062 -0.0104841 0.0109058 0.0553139 0.1270073 0.0276842 0.0000886 0.0577448 -0.0312513 -0.0002189 -0.0000015 -0.0002436 0.1674711 0.1319865 -0.0688216 0.0000357 -0.0469001 0.1226209 -0.0001071 0.0000428 0.0000363 0.1796629 0.0273122 0.067612 0.0001358 0.0644231 0.0822558 -0.0001213 0.0001024 -0.0001092 0.1687187 0.1584649 -0.0460317 0.0000562 0.0056397 0.1052127 -0.000261 0.0004011 -0.00092 0.3065231 0.0754486 -0.0067795 0.0000393 -0.0000114 -0.1087957 -0.0002725 0.0001011 -0.0002773 0.1515037 0.0679427 -0.0074213 0.0605712 0.0264834 0.033699 0.0854038 0.0138656 0.1060342 -0.03472 -0.0557448 -0.0220066 0.0056839 -0.0886709 0.0747944 0.0034303 0.0093304 -0.0002381 0.1321878 0.0644054 -0.0181649 -0.0678385 0.0201837 0.0219858 -0.0911924 -0.0185391 -0.1121473 -0.0221483 0.3238874 -0.0736122 -0.0000094 -0.1552868 0.1658021 -0.0001813 -0.0001062 -0.0002114 0.4011974 unknown
polarizability: 179.4093219|-1.3090822|125.8999418|0.0040721|0.019153|50.8051421 unknown
InChI: InChI=1S/C9H9NO3/c1-6(11)10-8-4-2-3-7(5-8)9(12)13/h2-5,10,12H,1H3
charge 0 multiplicity 1
22 atoms
O  -4.119229 0.109536 0.000971
O  3.614049 0.864065 -0.002859
O  -3.071178 -1.961116 -0.001833
N  1.924566 -0.768186 -0.003186
C  0.742821 0.024791 -0.001607
C  -0.499083 -0.655491 -0.00179
C  -1.712498 0.07079 -0.000431
C  0.762162 1.448239 -0.000047
C  -1.698726 1.489068 0.001184
C  -0.457975 2.15845 0.001346
C  3.26094 -0.350369 -0.002938
C  -2.978618 -0.708434 -0.000766
C  4.263127 -1.504487 0.000805
H  -0.551204 -1.751513 -0.003011
H  1.722134 1.967364 -0.000123
H  -2.643777 2.037462 0.002232
H  1.770477 -1.779655 -0.004033
H  -0.431755 3.25328 0.002534
H  4.164472 -2.116964 0.916218
H  5.278747 -1.085946 -0.034787
H  4.120364 -2.166907 -0.872956
H  -4.926518 -0.471376 0.000876
