program: Gaussian 09
title: 000048869
version: EM64L-G09RevD.01
frameworkgroup: C1[X(C13H19N5)]
method: RPBEPBE
basis: SDD
operation: Freq
keyword: #pfreq=noraman
keyword: PBEPBE/SDD
title: #p freq=noraman PBEPBE/SDD
converged: YES YES NO NO
title: Mulliken charges:
elementType: N N N N N C C C C C C C C C C C C C H H H H H H H H H H H H H H H H H H H
charge: -0.103022 -0.484991 -0.409353 -0.018449 -0.044456 -0.059182 -0.046948 -0.427810 -0.711851 -0.717912 -0.701202 0.277959 0.462665 -0.375781 -0.277120 -0.312505 -0.346091 -0.128242 0.127702 0.203755 0.202186 0.225140 0.202041 0.216866 0.222696 0.210865 0.243596 0.216233 0.220820 0.238708 0.199117 0.333344 0.353823 0.226849 0.301826 0.241165 0.237560
chargesum: 0.00000
title: Mulliken charges with hydrogens summed into heavy atoms:
elementType: N N N N N C C C C C C C C C C C C C
charge: -0.103022 -0.151647 -0.055530 -0.018449 -0.044456 0.068520 0.156806 -0.000484 -0.070248 -0.047218 -0.042557 0.277959 0.462665 -0.148931 0.024706 -0.071340 -0.108531 -0.128242
polarizability: 2.26560319e+02 -4.74584738e+00 2.06493314e+02 4.93224264e+00 -1.46342168e+00 1.12971724e+02
1716.lowfreq: -7.9251 -0.0009 -0.0008 -0.0007 5.2233 7.7738 26.3472 30.3655 45.3122
frequency: 25.6526 29.8379 45.2335 51.2439 82.3770 91.3859 101.7061 105.7095 117.2625 165.9590 196.0046 215.9119 237.2132 242.9512 246.2131 271.9190 280.7051 315.7239 331.7297 358.5375 379.6668 427.9105 434.1438 475.6873 485.2097 524.8200 539.0514 554.6722 586.2178 599.5964 658.4922 662.5827 676.6771 740.2606 745.7184 807.3226 827.8148 829.9796 880.8247 893.6086 911.6237 918.7541 952.7335 955.8049 956.0931 960.6244 988.0051 999.9017 1037.6732 1056.9232 1058.2902 1086.7115 1105.3745 1128.8384 1137.8906 1162.3920 1190.7660 1212.1271 1219.3605 1254.1927 1264.5154 1278.5854 1308.5108 1327.6010 1329.8945 1334.4246 1341.3653 1367.9141 1378.4124 1386.1510 1396.5706 1405.7681 1408.3898 1455.1843 1467.3467 1468.6817 1473.2557 1476.4754 1482.9830 1486.7458 1490.5632 1515.4409 1586.0263 1592.6068 1678.2212 2183.7780 2809.3202 2950.9427 2972.7023 2975.5873 2982.0404 2997.5467 3050.0625 3063.5524 3070.7189 3075.0451 3078.3562 3086.4617 3087.7603 3120.8205 3132.3997 3146.5579 3199.4856 3498.2493 3534.1949
redmass: 4.5321 4.5398 3.8091 2.9729 3.8642 3.8879 2.7400 5.0626 4.1897 3.8019 1.5862 1.1901 2.4837 2.7188 1.1576 2.8178 2.3156 4.3654 5.9976 2.8273 2.6145 1.8250 1.7464 3.8880 6.2229 2.3506 6.7257 2.8307 1.4057 5.1091 7.6431 6.8627 5.4005 3.3921 1.8996 2.4980 1.5084 2.3324 1.2629 2.2922 3.0558 1.2041 1.7591 2.2459 2.3429 1.7022 1.3682 3.0340 1.3969 2.0669 2.7916 1.5823 2.0596 2.8983 2.6054 2.2875 2.1072 3.2047 1.5160 1.3138 1.1741 2.4312 1.3379 2.0558 2.1146 1.4798 1.4288 1.4643 1.2104 1.2300 1.2120 1.3022 2.1562 1.0801 1.0496 1.9971 1.0497 1.0497 1.0468 1.0532 1.0534 3.0606 5.1159 2.7092 6.5552 12.2135 1.0793 1.0831 1.0368 1.0367 1.0360 1.0596 1.0991 1.0981 1.0998 1.0995 1.0988 1.1005 1.0996 1.0880 1.0906 1.0979 1.0948 1.0763 1.0757
irintensity: 0.7350 2.3432 1.4387 0.1007 0.9979 4.1388 3.1430 8.0066 0.4737 1.5247 1.2765 0.4455 1.7126 1.8618 0.4524 0.8879 0.1279 1.1286 2.8995 1.1101 0.0290 35.5411 57.0976 2.2570 11.0880 44.2845 31.3927 1.0121 9.9753 0.7882 35.1558 0.9311 2.8388 0.1058 4.5134 2.4307 83.0170 6.7120 4.7008 7.5654 27.3897 5.6710 7.8489 8.2906 9.9408 3.5907 2.8502 28.2396 2.2324 3.6559 12.3166 8.6020 22.1020 26.5404 2.8533 24.0217 17.5936 94.6362 74.5803 1.3391 3.2903 8.7801 5.9765 43.6124 37.1334 10.6591 22.7223 25.1035 15.0330 18.7153 20.2352 86.0797 25.8792 3.9190 1.6645 22.7470 8.8314 3.1988 7.6205 11.6702 13.3880 318.4757 459.1225 22.8361 569.2333 218.5996 113.4931 29.8965 35.1507 35.3374 20.6132 35.8905 6.3460 40.4947 13.5044 53.5989 55.8303 41.4815 49.2498 8.6896 27.9659 20.6663 10.3339 38.8275 71.4371
temp: 298.150 k
press: 1.00000 atm
elementType: 7 7 7 7 7 6 6 6 6 6 6 6 6 6 6 6 6 6 1 1 1 1 1 1 1 1 1 1 1 1 1 1 1 1 1 1 1
symmnumber: 1
zpe: 803022.2 jmol-1
zpe.correction: 0.305855 hartree
zpe.thermalcorrener: 0.325044 hartree
zpe.thermalcorrenthalpy: 0.325989 hartree
zpe.thermalcorrgfe: 0.256912 hartree
zpe.sumelectzpe: -779.154883 hartree
zpe.sumelectthermal: -779.135694 hartree
zpe.sumelectthermalent: -779.134750 hartree
zpe.sumelectthermalfe: -779.203826 hartree
dipole: 5.0151 0.1441 0.1403
dipole: 5.0191
quadrupole: -111.6241 -126.8957 -111.2940
quadrupole: -7.8002 0.0201 -0.7701
quadrupole: 4.9805 -10.2911 5.3106 -7.8002 0.0201 -0.7701
hfenergy: -779.4607382 hartree
pointgroup: C01 [X(C13H19N5)]
dipole: -1.9681397 -0.0630308 -0.1474282 debye
polarizability: 225.2123128|5.8009974|207.126794|10.0989194|2.4210606|113.6862499 unknown
InChI: InChI=1S/C13H19N5/c1-4-12(10(2)3)18-13(16-9-14)17-11-5-7-15-8-6-11/h5-8,10,12,16-17H,4H2,1-3H3
charge 0 multiplicity 1
37 atoms
N  -0.893398 -0.296944 -0.19797
N  1.015955 1.101835 0.100018
N  -1.098284 2.123094 -0.162326
N  4.298094 -1.613532 0.478946
N  -0.047623 4.438609 0.008066
C  -2.351177 -0.501875 -0.358624
C  -3.028205 -0.627706 1.053038
C  -2.564132 -1.727912 -1.280538
C  -4.570945 -0.583056 0.94842
C  -2.554069 -1.877525 1.829397
C  -2.059073 -1.481619 -2.716889
C  -0.349828 0.876157 -0.090096
C  2.059881 0.157636 0.218531
C  3.377725 0.656785 0.419597
C  1.883992 -1.250066 0.150103
C  4.44386 -0.254119 0.541731
C  3.024413 -2.071143 0.285121
C  -0.565323 3.357066 -0.079041
H  -2.848715 0.362827 -0.876192
H  -2.704994 0.265398 1.631306
H  -3.64081 -1.982029 -1.301712
H  -2.027966 -2.590052 -0.843265
H  -4.921704 0.306662 0.390041
H  -4.969479 -1.480463 0.441038
H  -5.022617 -0.545669 1.956551
H  -2.934004 -1.85245 2.867187
H  -1.451685 -1.926942 1.865143
H  -2.927853 -2.806273 1.360498
H  -2.208436 -2.37474 -3.349889
H  -0.981063 -1.241292 -2.713097
H  -2.596844 -0.638762 -3.192876
H  1.308194 2.0816 0.164331
H  -2.102897 2.025067 -0.321791
H  3.570923 1.734731 0.479916
H  0.88912 -1.667674 -0.004802
H  5.465308 0.111101 0.696927
H  2.916161 -3.160926 0.235503
