program: Gaussian 09
title: 000048842
version: EM64L-G09RevD.01
frameworkgroup: C1[X(C13H19NO2)]
method: RPBEPBE
basis: SDD
operation: Freq
keyword: #p
keyword: freq=noraman
keyword: PBEPBE/SDD
title: #p freq=noraman PBEPBE/SDD
converged: YES YES NO NO
title: Mulliken charges:
elementType: O O N C C C C C C C C C C C C C H H H H H H H H H H H H H H H H H H H
charge: -0.312208 -0.263830 -0.324194 -0.088195 -0.062426 -0.344326 -0.720463 -0.328932 0.248453 0.246467 -0.374824 -0.376820 -0.378362 -0.681001 -0.228335 -0.225911 0.204315 0.236619 0.217592 0.253536 0.265007 0.211179 0.240139 0.222329 0.176110 0.197747 0.190396 0.216695 0.244180 0.247922 0.208195 0.220808 0.208004 0.226810 0.227324
chargesum: 0.00000
title: Mulliken charges with hydrogens summed into heavy atoms:
elementType: O O N C C C C C C C C C C C C C
charge: -0.312208 -0.263830 -0.059187 0.116120 0.174192 0.126803 -0.046817 0.044924 0.248453 0.246467 0.032267 -0.132640 -0.130440 -0.043993 -0.001525 0.001413
polarizability: 1.99668698e+02 -1.87394056e+01 1.15578055e+02 -8.62381853e+00 2.11744227e+00 1.43612564e+02
1716.lowfreq: -11.2885 0.0006 0.0007 0.0007 5.2097 7.7759 28.8966 43.3679 58.1145
frequency: 28.8759 43.2099 58.1042 85.4721 99.2284 126.2089 146.2955 173.3761 181.6422 217.7421 229.3334 238.8419 286.1665 290.8123 330.7297 373.3881 421.3206 449.8723 451.9888 484.7784 493.2861 541.4571 554.9104 603.8367 658.8899 691.2087 711.7145 732.5129 753.2437 755.4596 820.8292 845.4057 853.9683 871.7519 889.0477 901.8446 929.8860 949.3623 958.0560 964.2623 988.3700 1023.1071 1033.4151 1053.6674 1070.5071 1084.3467 1107.1690 1111.8370 1124.2948 1152.7724 1160.6532 1163.1864 1192.1593 1201.2183 1232.6641 1239.1285 1264.7580 1276.0809 1281.9628 1295.2599 1317.0991 1326.5213 1333.2230 1353.7709 1373.7708 1381.0843 1390.1999 1391.0673 1441.7052 1447.2448 1462.7217 1470.1665 1472.5981 1475.6483 1477.5193 1479.4461 1482.7317 1495.2128 1590.7214 1611.8685 2866.5773 2971.6997 2972.8787 2974.8799 2980.8147 2989.4443 2990.7675 3029.4555 3036.8195 3071.0568 3073.2919 3077.4134 3094.8438 3108.7547 3135.8591 3149.1394 3161.7366 3174.2052 3437.1390
redmass: 4.3291 3.8860 1.5635 3.4009 4.0372 2.9043 3.0328 2.2474 3.5103 1.1106 1.2398 3.9242 3.0395 4.9233 3.4944 3.8296 3.4543 3.1509 4.4136 3.3694 3.9523 5.6515 4.6964 3.2345 3.6838 1.5637 4.3290 4.9162 1.2377 1.0823 4.9949 1.4113 2.7289 2.1360 1.3911 1.5034 1.3677 2.0711 4.0769 1.2902 1.7978 2.3808 2.8422 2.8096 1.8496 2.3888 2.2023 2.1169 2.0570 2.4725 1.0769 2.1726 2.2742 1.2126 1.6623 2.1368 1.4657 1.2215 1.2531 1.1931 1.4031 1.3086 1.3729 1.5764 1.3887 1.2815 5.2254 1.2594 2.2147 1.2340 1.1897 1.0565 1.0602 2.5321 1.0444 1.0705 1.0649 1.0883 7.5321 7.0665 1.0696 1.0807 1.0631 1.0409 1.0405 1.0816 1.0830 1.0594 1.0991 1.1010 1.0980 1.0990 1.1006 1.1067 1.0850 1.0897 1.0947 1.1006 1.0737
irintensity: 0.0766 0.3815 0.5484 1.5013 1.4525 1.9681 3.7321 1.8353 0.2794 0.1757 0.1720 6.5621 0.3155 0.2558 1.0588 4.5840 0.9884 6.7299 2.8780 4.7177 0.2259 0.7186 1.2102 3.9900 7.1964 107.1743 0.2163 11.9630 109.5389 8.0657 21.9881 0.0588 2.8746 48.4127 13.4289 6.5395 4.9498 6.5699 68.9166 0.1224 17.3516 10.9700 21.0695 1.2116 10.8815 34.4882 7.0701 4.8498 2.3112 69.7340 5.7917 11.4250 10.0119 13.0698 113.7551 147.0053 1.2133 3.3556 7.8198 4.3257 0.5342 6.2774 19.3906 5.8126 11.0664 17.6941 19.0481 17.9394 15.7883 65.5684 13.8652 2.9508 12.0573 169.2804 14.6606 4.8016 6.3523 10.3959 25.8942 4.0935 104.6779 19.1540 27.1721 26.6731 16.7211 39.5640 61.6867 30.5832 10.7930 73.9307 49.6929 44.5754 26.7095 22.5792 1.0636 13.3358 16.7645 15.8001 0.7109
temp: 298.150 k
press: 1.00000 atm
elementType: 8 8 7 6 6 6 6 6 6 6 6 6 6 6 6 6 1 1 1 1 1 1 1 1 1 1 1 1 1 1 1 1 1 1 1
symmnumber: 1
zpe: 779522.4 jmol-1
zpe.correction: 0.296904 hartree
zpe.thermalcorrener: 0.313028 hartree
zpe.thermalcorrenthalpy: 0.313972 hartree
zpe.thermalcorrgfe: 0.252565 hartree
zpe.sumelectzpe: -710.725411 hartree
zpe.sumelectthermal: -710.709287 hartree
zpe.sumelectthermalent: -710.708343 hartree
zpe.sumelectthermalfe: -710.769750 hartree
dipole: -2.1818 0.8165 -0.4042
dipole: 2.3644
quadrupole: -91.7627 -96.6223 -95.1701
quadrupole: -3.4244 -2.8067 2.4287
quadrupole: 2.7557 -2.1039 -0.6517 -3.4244 -2.8067 2.4287
hfenergy: -711.0223151 hartree
pointgroup: C01 [X(C13H19N1O2)]
dipole: -0.857588 -0.0804971 -0.3512427 debye
polarizability: 199.7264114|-12.6590942|142.8766584|16.2094213|4.7218926|116.2562463 unknown
InChI: InChI=1S/C13H19NO2/c1-3-8-14-10(2)13-9-15-11-6-4-5-7-12(11)16-13/h4-7,10,13-14H,3,8-9H2,1-2H3
charge 0 multiplicity 1
35 atoms
O  0.389555 -0.578419 -0.683946
O  1.510762 1.8965 0.387804
N  -2.338467 -0.033927 -0.033438
C  -1.706686 0.511427 -1.258137
C  -0.210604 0.75627 -0.977422
C  0.053015 1.690911 0.209848
C  -1.891161 -0.35141 -2.537206
C  -3.81438 -0.100973 -0.018205
C  1.699743 -0.515575 -0.154303
C  2.249364 0.693793 0.355166
C  -4.330924 -0.506724 1.377613
C  2.467149 -1.698175 -0.145107
C  3.572534 0.713783 0.841984
C  -5.870929 -0.594556 1.433993
C  3.786917 -1.678314 0.356047
C  4.343108 -0.468942 0.840346
H  -2.161328 1.507949 -1.441916
H  0.286982 1.158533 -1.883843
H  -0.359561 2.696003 0.026717
H  -0.387628 1.266495 1.128916
H  -1.901425 -0.928813 0.230059
H  -1.472002 0.157488 -3.425929
H  -1.376894 -1.32168 -2.422989
H  -2.962346 -0.5379 -2.730711
H  -4.237532 -0.807587 -0.775155
H  -4.205137 0.905323 -0.273209
H  -3.892807 -1.487513 1.655927
H  -3.957227 0.226217 2.117344
H  2.018993 -2.615374 -0.540752
H  3.972205 1.658357 1.224288
H  -6.25628 -1.345078 0.718067
H  -6.21808 -0.881668 2.442853
H  -6.334133 0.378375 1.18274
H  4.37855 -2.599619 0.360735
H  5.369251 -0.447177 1.221724
