program: Gaussian 09
title: 000004990
version: EM64L-G09RevD.01
frameworkgroup: C1[X(C11H15N3O4)]
method: RPBEPBE
basis: SDD
operation: Freq
keyword: #p
keyword: freq=noraman
keyword: PBEPBE/SDD
title: #p freq=noraman PBEPBE/SDD
converged: YES YES NO NO
title: Mulliken charges:
elementType: O O O O N N N C C C C C C C C C C C H H H H H H H H H H H H H H H
charge: -0.316135 -0.316004 -0.282632 -0.282360 -0.013097 -0.375593 -0.375604 0.092914 0.092659 -0.369055 -0.369454 -0.307411 -0.307388 -0.172922 0.310806 0.310635 -0.604730 -0.604702 0.270314 0.244589 0.270300 0.244720 0.252579 0.252657 0.236013 0.328276 0.328236 0.230137 0.228258 0.272789 0.228280 0.230111 0.272813
chargesum: 0.00000
title: Mulliken charges with hydrogens summed into heavy atoms:
elementType: O O O O N N N C C C C C C C C C C C
charge: -0.316135 -0.316004 -0.282632 -0.282360 -0.013097 -0.047317 -0.047368 0.092914 0.092659 0.145848 0.145566 -0.054832 -0.054731 0.063091 0.310806 0.310635 0.126454 0.126502
polarizability: 2.24858574e+02 -4.33781754e-02 1.34929565e+02 1.06877961e-01 -3.34444973e+00 1.03576351e+02
1716.lowfreq: -8.0355 0.0005 0.0006 0.0009 3.4542 3.6283 11.8461 18.5468 19.9746
frequency: 11.5667 18.4390 19.4998 22.0297 46.0510 55.5024 99.7232 99.9959 132.6376 152.0320 153.6088 170.1025 173.1807 215.9503 219.3456 246.9132 253.1892 318.1471 336.9288 380.4270 425.8247 517.0039 532.6065 539.9247 580.9895 583.0493 590.2186 606.1356 635.5726 653.2724 693.1157 693.8667 735.0335 744.4180 784.0892 848.0559 851.7635 895.4664 913.5321 960.9487 979.0662 996.0144 998.0090 1019.8961 1031.5251 1080.5966 1101.4506 1105.2864 1127.0692 1127.1011 1146.8330 1146.8608 1166.4447 1200.5398 1202.8742 1223.7639 1234.7084 1235.3395 1278.4975 1313.7813 1319.7621 1352.0770 1407.9366 1430.6797 1431.0635 1435.5538 1445.4318 1459.6043 1462.7599 1463.5236 1484.2930 1484.3313 1517.2240 1518.2002 1575.1582 1589.5089 1688.0746 1688.9653 2980.0716 2980.2103 3007.7075 3008.5952 3057.7858 3057.8314 3085.3953 3085.7642 3113.8979 3113.9547 3140.6702 3174.8881 3182.2677 3575.6611 3575.7252
redmass: 5.1257 5.4135 5.0708 4.1873 4.0757 4.1926 1.1392 1.1423 4.8198 4.5188 3.2578 3.8800 5.1073 2.7222 3.1473 4.8869 6.0236 4.3498 3.8840 5.2825 3.4994 2.9747 4.6586 4.9584 1.5617 1.1359 2.4363 5.3402 5.4443 5.4535 11.9675 12.1707 3.6310 4.4500 1.2775 3.8095 3.7651 4.1627 1.3467 6.4769 5.4607 3.7147 1.3878 2.1518 2.4414 1.6225 5.2781 5.4783 1.2829 1.2833 1.7000 1.7005 1.1125 2.1697 2.1579 1.9347 1.1596 1.1380 3.0782 3.5542 1.6846 1.5766 2.5977 1.1740 1.1643 1.4328 1.1207 1.5680 1.3650 1.2851 1.0447 1.0447 1.4205 1.4416 7.2682 5.5312 8.7706 8.7873 1.0355 1.0355 1.0596 1.0596 1.1026 1.1026 1.1026 1.1026 1.0982 1.0982 1.0889 1.0924 1.0981 1.0772 1.0772
irintensity: 0.1157 0.8623 0.3192 0.0963 9.6157 4.5313 0.3968 0.2126 4.6220 4.2192 1.5982 0.4122 0.6545 0.5061 13.1688 3.6976 6.1642 38.7503 26.6772 34.1461 0.1089 0.0096 0.2137 12.6163 173.7823 68.6187 37.7366 6.7026 6.1610 12.8899 31.9760 18.0676 3.3547 3.9361 42.5838 4.5899 44.0225 48.9953 0.0013 4.9368 9.1308 85.4469 0.6574 1.3092 11.7687 5.6773 684.3682 55.4914 0.1016 0.1432 17.3459 14.6058 0.0017 369.2914 85.5005 0.7377 13.3223 11.5039 2.5800 4.4092 5.2616 0.3113 3.6463 0.5761 61.1337 77.0318 34.8192 103.4163 140.7354 64.4044 11.8390 20.2649 286.3670 50.1477 65.1383 39.0627 102.4407 429.1532 143.3059 24.4830 27.1421 18.4490 28.0480 47.1692 3.0763 11.4744 3.8599 4.0108 8.6835 8.5734 8.3792 15.2364 58.6940
temp: 298.150 k
press: 1.00000 atm
elementType: 8 8 8 8 7 7 7 6 6 6 6 6 6 6 6 6 6 6 1 1 1 1 1 1 1 1 1 1 1 1 1 1 1
symmnumber: 1
zpe: 679002.7 jmol-1
zpe.correction: 0.258618 hartree
zpe.thermalcorrener: 0.277694 hartree
zpe.thermalcorrenthalpy: 0.278638 hartree
zpe.thermalcorrgfe: 0.205737 hartree
zpe.sumelectzpe: -891.983843 hartree
zpe.sumelectthermal: -891.964768 hartree
zpe.sumelectthermalent: -891.963824 hartree
zpe.sumelectthermalfe: -892.036724 hartree
dipole: -0.0097 4.5049 -3.4062
dipole: 5.6477
quadrupole: -61.4078 -100.0174 -113.7623
quadrupole: -0.0451 -0.1279 3.5923
quadrupole: 30.3214 -8.2883 -22.0331 -0.0451 -0.1279 3.5923
hfenergy: -892.2424612 hartree
pointgroup: C01 [X(C11H15N3O4)]
dipole: -0.001915 0.9493581 2.0089661 debye
polarizability: 224.8583729|-0.0610653|103.5484921|-0.1624339|-3.2112814|134.9576245 unknown
InChI: InChI=1S/C11H15N3O4/c1-12-10(15)17-6-8-4-3-5-9(14-8)7-18-11(16)13-2/h3-5,12-13H,6-7H2,1-2H3
charge 0 multiplicity 1
33 atoms
O  3.626345 1.147769 -0.21293
O  -3.633332 1.15597 -0.202405
O  4.39281 -0.927644 -1.066914
O  -4.383697 -0.922958 -1.061962
N  -0.003577 1.050814 -0.870917
N  5.606374 0.319217 0.518598
N  -5.603475 0.306645 0.532262
C  1.170522 0.862099 -0.200372
C  -1.176533 0.8706 -0.196054
C  2.415488 1.054938 -1.049394
C  -2.422894 1.075119 -1.040549
C  1.218746 0.500788 1.16591
C  -1.222554 0.509905 1.170414
C  -0.001289 0.32405 1.855678
C  4.54622 0.071575 -0.320795
C  -4.543744 0.071816 -0.311384
C  6.74432 -0.597208 0.62576
C  -6.733205 -0.619999 0.638618
H  2.530591 0.212456 -1.757485
H  2.342703 1.997948 -1.615714
H  -2.537421 0.243083 -1.760813
H  -2.351945 2.026598 -1.592798
H  2.183616 0.375129 1.662862
H  -2.186568 0.391578 1.670788
H  -0.000337 0.045261 2.915017
H  5.592516 1.194268 1.042933
H  -5.596031 1.179794 1.059884
H  7.68186 -0.117736 0.28766
H  6.877133 -0.951448 1.664535
H  6.541171 -1.465709 -0.020424
H  -6.859871 -0.980064 1.676156
H  -7.675817 -0.147069 0.305443
H  -6.524525 -1.483786 -0.012109
