program: Gaussian 09
title: 000048820
version: EM64L-G09RevD.01
frameworkgroup: C1[X(C10H9N5)]
method: RPBEPBE
basis: SDD
operation: Freq
keyword: #pfreq=noraman
keyword: PBEPBE/SDD
title: #p freq=noraman PBEPBE/SDD
converged: YES YES NO NO
title: Mulliken charges:
elementType: N N N N N C C C C C C C C C C H H H H H H H H H
charge: -0.039475 -0.164650 -0.017576 -0.011774 -0.012457 0.226617 -0.456839 -0.498976 0.443485 0.428385 -0.530221 -0.614840 -0.596492 -0.251418 -0.255031 0.294612 0.278396 0.282789 0.224917 0.264715 0.264267 0.263594 0.238947 0.239023
chargesum: 0.00000
title: Mulliken charges with hydrogens summed into heavy atoms:
elementType: N N N N N C C C C C C C C C C
charge: -0.039475 -0.164650 -0.017576 -0.011774 -0.012457 0.226617 -0.162227 -0.220580 0.443485 0.428385 -0.247432 0.139059 0.145072 -0.251418 -0.255031
polarizability: 2.57890906e+02 4.90007057e+00 1.77963877e+02 3.82488382e-03 -3.19782508e-03 6.39998829e+01
1716.lowfreq: -0.0005 0.0007 0.0007 3.0804 4.4670 6.7197 24.3467 67.9954 74.8832
frequency: 24.2941 67.9944 74.8823 97.0681 107.3374 122.8599 148.4439 163.4745 171.2431 212.3944 251.0829 301.5521 316.2287 374.6596 397.4707 429.5029 443.5007 449.0169 451.4603 514.8695 532.1098 634.7866 635.9493 640.5842 692.2655 696.0461 851.7852 911.4712 926.4096 932.2953 940.6285 975.7686 991.3377 1038.3873 1073.5962 1082.6054 1128.7289 1138.6579 1153.2169 1269.2429 1271.6489 1292.5287 1334.9668 1346.0831 1382.8390 1418.2976 1419.3054 1431.0800 1442.2449 1444.5287 1468.1084 1479.5509 1490.5350 1577.4259 1595.4151 2184.1300 2186.4629 2978.4216 2991.5695 3057.1680 3071.2309 3124.2428 3128.6551 3172.4573 3176.3891 3178.5360
redmass: 3.1022 4.6986 5.5651 1.3411 11.8522 2.3470 1.5601 5.3391 5.9062 2.1236 4.3261 4.7126 4.3325 5.8635 7.0479 3.4731 9.9504 7.4040 7.8361 10.0016 6.5794 5.7322 5.6614 6.5492 6.5786 1.9497 4.5233 1.5166 7.3797 1.6571 1.4426 5.6084 5.1129 1.4638 2.1645 1.2477 1.3543 1.7059 1.4821 4.5763 1.7490 2.7968 7.4713 3.3879 7.5015 3.5889 1.1589 3.0942 1.0440 1.3210 1.0448 1.0681 1.1736 5.8154 6.2517 12.6357 12.6308 1.0354 1.0338 1.1020 1.0999 1.1010 1.0991 1.0928 1.0929 1.0938
irintensity: 0.0031 0.0366 0.2246 2.2935 5.8254 7.6445 2.3661 0.0012 2.7808 4.9545 0.4068 0.0542 0.9117 0.0151 1.2353 5.7049 2.9912 0.4665 0.5184 0.0429 17.4070 4.3555 0.0278 0.0030 5.2764 19.9512 24.5582 19.1078 11.4015 37.3190 10.7959 1.8351 12.1190 16.4899 93.3823 0.1042 0.4591 4.6019 6.2264 0.8797 5.9136 4.1320 223.0141 308.2341 36.9493 62.7031 28.0022 7.6521 20.6855 28.1831 13.8858 16.9648 78.9459 82.3793 23.8754 31.1061 16.8518 67.1742 44.8073 27.7153 15.1467 7.3029 12.9117 0.0429 1.0273 0.0537
temp: 298.150 k
press: 1.00000 atm
elementType: 7 7 7 7 7 6 6 6 6 6 6 6 6 6 6 1 1 1 1 1 1 1 1 1
symmnumber: 1
zpe: 460616.3 jmol-1
zpe.correction: 0.175439 hartree
zpe.thermalcorrener: 0.190014 hartree
zpe.thermalcorrenthalpy: 0.190958 hartree
zpe.thermalcorrgfe: 0.132509 hartree
zpe.sumelectzpe: -659.085031 hartree
zpe.sumelectthermal: -659.070456 hartree
zpe.sumelectthermalent: -659.069512 hartree
zpe.sumelectthermalfe: -659.127961 hartree
dipole: 9.0056 -0.7681 0.0070
dipole: 9.0383
quadrupole: -75.8484 -110.5460 -87.6916
quadrupole: -3.8566 0.0542 0.0089
quadrupole: 15.5136 -19.1840 3.6704 -3.8566 0.0542 0.0089
hfenergy: -659.2604705 hartree
pointgroup: C01 [X(C10H9N5)]
dipole: 3.5548335 0.0776798 -0.0440558 debye
dipolederiv: -1.6791803 -0.2769755 0.1113749 0.081854 -0.1272132 -0.0409778 -0.0066828 -0.0370187 -0.2200167 -1.3789578 -0.119021 0.0504688 -1.0450159 -0.2652806 0.0442244 0.4001449 0.0403831 -0.1771238 1.8414525 0.3196478 -0.1305426 0.6123083 -0.1498693 0.0392358 -0.24442 0.039223 -0.0523885 -0.2992383 -0.091102 0.0345831 -0.1127366 -0.3360732 0.0371895 0.0429726 0.0373308 -0.2529727 -0.256116 0.0652811 -0.0245529 0.1152915 -0.3605348 0.0453284 -0.043371 0.0455083 -0.2557743 1.5177075 0.0170371 -0.0135144 -0.0052033 -0.1079344 0.0574159 -0.0058365 0.057405 0.0221646 -0.30434 -0.095293 0.0367098 0.2811214 -0.0768492 -0.0205111 -0.1050601 -0.0187518 -0.1204074 -0.3924504 0.0600248 -0.0216024 -0.2544509 -0.0386149 -0.0391578 0.0974268 -0.0407621 -0.1307615 0.1362117 0.0628896 -0.023672 -0.0467447 0.1153724 0.0058688 0.0177716 0.0052221 0.1281721 0.29087 -0.0458458 0.0165055 -0.0357272 0.1082647 0.0069978 0.0125797 0.0068991 0.1238197 -0.2628864 -0.0144242 0.0057727 0.1157488 -0.0627464 -0.0371592 -0.0433346 -0.0364598 -0.145768 0.228162 -0.0471161 0.017252 -0.1972082 0.1370009 0.0217288 0.069752 0.0212722 0.1876954 0.3409662 0.202951 -0.0756057 0.5179172 0.2492736 -0.0042253 -0.2011595 -0.0037793 0.2418994 0.1100429 0.1989362 -0.075546 0.2240971 0.2104442 -0.0722274 -0.0851046 -0.072174 0.049895 0.0090882 -0.1499571 0.0566064 -0.200245 0.2691171 -0.0930157 0.0755609 -0.0932257 0.0544228 0.1097124 -0.054161 0.0207094 -0.0457547 0.055733 0.0400804 0.0174277 0.040186 0.1462661 0.0995813 0.0465884 -0.0172241 0.0455704 0.0336 0.0482567 -0.0168876 0.0483087 0.1438708 0.0039736 0.0109745 -0.0031249 0.0129712 0.1119913 0.0246012 -0.0037724 0.0246368 0.168128 -0.1557971 0.005122 0.0000833 -0.0330292 0.0978688 0.0108017 0.0146223 0.0104629 0.1204026 0.0661448 -0.0653134 -0.0543732 0.0740679 -0.0230765 -0.0526284 -0.0233315 -0.0770829 0.0148655 0.0655299 -0.0117934 0.0823473 0.0731588 0.0577673 0.0125895 -0.0348991 0.038732 -0.0682056 0.0813232 0.1151844 -0.0444857 0.0325161 0.008035 0.0482062 -0.0124449 0.0479875 0.1163998 -0.0856734 -0.0328029 0.1151186 -0.0452169 0.0398419 -0.0795917 0.1926301 -0.0210339 -0.0388348 -0.0861266 -0.1008316 -0.063288 -0.16529 0.0538822 -0.0030308 -0.1145839 -0.0632693 -0.0557485 unknown
polarizability: 255.8569515|12.3116149|165.4819556|-5.5981632|-38.374829|78.5157584 unknown
InChI: InChI=1S/C10H9N5/c1-15(2)14-13-10-4-8(6-11)3-9(5-10)7-12/h3-5H,1-2H3
charge 0 multiplicity 1
24 atoms
N  3.825424 0.218312 -0.141988
N  1.760284 -0.57368 0.168853
N  2.498615 0.453253 -0.223589
N  -3.429111 -3.239639 1.205384
N  -2.70072 3.294115 -1.266229
C  0.36002 -0.312219 0.076856
C  -0.225269 0.901843 -0.377789
C  -0.481714 -1.37807 0.48384
C  -1.634617 1.034911 -0.420216
C  -1.892016 -1.238966 0.439333
C  -2.480466 -0.030644 -0.013547
C  4.36912 -1.062982 0.343904
C  4.706913 1.316179 -0.553987
C  -2.732693 -2.332316 0.857712
C  -2.219703 2.269232 -0.882341
H  0.419607 1.726414 -0.692056
H  -0.021509 -2.307116 0.832239
H  -3.567448 0.079674 -0.048736
H  5.468284 -1.010719 0.315873
H  4.01067 -1.896074 -0.287097
H  4.022458 -1.261843 1.374063
H  4.075339 2.157587 -0.875165
H  5.355167 1.005999 -1.394387
H  5.348563 1.642448 0.28557
