program: Gaussian 09
title: 000005018
version: EM64L-G09RevD.01
frameworkgroup: C1[X(C17H18ClNO)]
method: RPBEPBE
basis: SDD
operation: Freq
keyword: #p
keyword: freq=noraman
keyword: PBEPBE/SDD
title: #p freq=noraman PBEPBE/SDD
converged: YES YES NO NO
title: Mulliken charges:
elementType: Cl O N C C C C C C C C C C C C C C C C C H H H H H H H H H H H H H H H H H H
charge: -0.066353 -0.415316 -0.074855 -0.356355 -0.468612 0.477347 -0.364065 -0.602226 0.389155 0.389436 -0.606915 -0.625169 -0.471236 -0.391877 -0.389478 0.411071 -0.345417 -0.234881 -0.245985 -0.248472 0.227336 0.209317 0.218034 0.206609 0.193585 0.250916 0.211983 0.270273 0.194564 0.225219 0.222269 0.259510 0.245843 0.275257 0.223311 0.221314 0.225795 0.359068
chargesum: 0.00000
title: Mulliken charges with hydrogens summed into heavy atoms:
elementType: Cl O N C C C C C C C C C C C C C C C C C
charge: -0.066353 -0.056248 -0.074855 -0.129019 -0.041261 0.477347 0.036129 -0.139328 0.389155 0.389436 -0.336642 0.016883 -0.211726 -0.146034 -0.114221 0.411071 -0.345417 -0.011570 -0.024671 -0.022676
polarizability: 2.62547359e+02 9.68714618e+00 1.83538279e+02 -7.31019733e+00 -3.67353758e+00 1.52163227e+02
1716.lowfreq: -0.0026 -0.0015 -0.0013 1.8761 6.7791 10.4007 31.6325 41.3136 53.2067
frequency: 31.5697 41.3067 53.1862 89.4670 93.9889 147.3494 172.7770 192.3951 211.5579 223.3361 237.6084 243.2761 260.1542 284.7805 294.4657 334.3985 356.9821 384.5862 395.5033 402.9689 444.2877 454.4052 459.3230 472.3352 494.3660 524.3512 580.2368 615.6122 636.4932 652.0254 681.9684 700.6509 704.6361 734.2191 754.9211 763.2657 774.3241 838.0057 852.6980 866.1002 889.2336 914.7079 925.8259 938.3811 975.7262 977.9194 991.1515 994.8388 1001.0762 1013.2975 1031.2391 1051.8290 1076.2421 1088.5474 1110.6509 1130.3559 1143.5413 1169.9279 1171.5360 1187.1892 1190.8882 1193.9710 1197.1471 1221.7135 1241.5254 1258.2563 1277.9260 1289.4807 1314.8876 1322.2372 1332.9007 1338.2369 1360.0036 1376.5747 1385.6004 1394.5291 1421.3359 1430.7258 1435.3789 1460.4734 1460.8482 1463.8949 1476.9362 1484.1815 1485.7094 1487.7170 1584.3841 1588.1463 1610.2452 1616.1742 2840.4376 2845.5340 2866.0961 2957.8613 2992.5767 3003.9984 3012.7879 3018.7764 3052.9633 3072.8063 3117.8463 3125.7594 3138.9600 3145.8249 3150.8195 3156.2269 3172.5068 3502.3288
redmass: 4.0046 6.8391 5.1372 3.6156 4.8528 3.5129 6.5749 4.5758 2.0862 1.5825 4.2092 4.7228 5.9769 4.0036 3.6788 2.3653 1.9616 5.5582 4.4410 2.8183 1.4787 1.9038 3.5099 3.4842 4.6304 3.7980 3.4710 6.2863 3.8805 6.0738 4.1427 3.0402 2.4609 3.5173 2.1965 3.2565 3.6797 2.8567 1.2621 1.4481 1.5446 1.7196 2.6587 2.0184 1.4696 2.6217 2.9675 1.6451 2.2712 2.3717 2.1690 2.4596 2.0808 1.7070 1.3916 2.4380 2.4721 1.3778 1.0674 1.5260 1.4881 1.9437 1.1273 1.8257 1.6310 1.5066 2.4244 1.6910 1.4392 1.4326 1.3748 1.5382 1.2963 5.9278 1.5937 2.9506 3.0774 1.2210 2.2132 1.0697 1.0635 1.1098 1.1883 2.0304 1.1457 2.6153 7.0305 6.0156 6.1974 7.1649 1.0717 1.0673 1.0588 1.0823 1.0618 1.0867 1.0736 1.0871 1.1009 1.1008 1.0845 1.0881 1.0938 1.0912 1.0922 1.0985 1.0959 1.0649
irintensity: 0.0223 0.0631 0.0817 0.8235 0.2896 0.2686 0.5448 1.1218 0.4640 0.4801 2.8669 2.1396 1.6192 1.1575 3.9510 2.7667 5.4652 2.4784 2.1356 0.2204 112.3161 33.1362 8.1906 0.0681 20.8959 12.0533 5.0943 0.1887 2.0340 2.2855 10.5651 16.7407 44.1215 38.2989 32.3007 5.8275 12.9522 12.9809 0.0374 4.2144 22.2763 17.1632 13.2721 13.2823 0.4349 12.5904 0.0536 2.4442 35.5364 13.0721 8.8543 6.0798 21.8280 4.4584 3.0034 20.2035 101.5566 30.1274 1.1284 26.8401 2.2623 69.2065 3.6361 20.6712 4.7817 31.6970 13.1042 3.4252 23.1077 5.3608 4.4620 11.1669 7.9204 0.0872 3.7462 15.8777 4.9862 7.6960 3.4237 4.6015 21.0479 14.4155 20.0395 36.4970 22.1552 112.4677 18.1655 0.2197 20.4469 15.7164 43.7815 61.4684 248.4709 17.1404 10.9100 40.7328 42.7920 55.1520 19.4550 35.3259 2.1276 4.1227 31.7984 4.1445 0.7847 33.6440 12.2845 64.2598
temp: 298.150 k
press: 1.00000 atm
elementType: 17 8 7 6 6 6 6 6 6 6 6 6 6 6 6 6 6 6 6 6 1 1 1 1 1 1 1 1 1 1 1 1 1 1 1 1 1 1
symmnumber: 1
zpe: 808168.6 jmol-1
zpe.correction: 0.307815 hartree
zpe.thermalcorrener: 0.325513 hartree
zpe.thermalcorrenthalpy: 0.326457 hartree
zpe.thermalcorrgfe: 0.261993 hartree
zpe.sumelectzpe: -1247.178263 hartree
zpe.sumelectthermal: -1247.160565 hartree
zpe.sumelectthermalent: -1247.159621 hartree
zpe.sumelectthermalfe: -1247.224085 hartree
dipole: 1.1369 1.8200 -0.2804
dipole: 2.1641
quadrupole: -122.8322 -118.7628 -125.2130
quadrupole: 3.9667 0.7691 0.9614
quadrupole: -0.5629 3.5065 -2.9437 3.9667 0.7691 0.9614
hfenergy: -1247.4860782 hartree
pointgroup: C01 [X(C17H18Cl1N1O1)]
dipole: -0.388285 0.7548834 0.0658302 debye
polarizability: 260.6811646|-16.6888852|186.0157836|-0.2913986|2.3323973|151.5519165 unknown
InChI: InChI=1S/C17H18ClNO/c1-19-8-7-13-9-16(18)17(20)10-14(13)15(11-19)12-5-3-2-4-6-12/h2-6,9-10,15,20H,7-8,11H2,1H3
charge 0 multiplicity 1
38 atoms
Cl 5.050539 -0.439788 1.289855
O  4.019766 -1.526218 -1.404473
N  -1.479203 2.449294 -0.21125
C  -0.621648 0.161667 -1.098702
C  -1.048082 1.63367 -1.371206
C  0.776172 0.044178 -0.479302
C  -0.437232 2.708459 0.809721
C  0.039696 1.432822 1.550886
C  1.076797 0.627182 0.788104
C  -1.666655 -0.71781 -0.376292
C  1.778304 -0.661146 -1.17986
C  -2.119603 3.703571 -0.661393
C  2.379609 0.474325 1.318664
C  -1.321865 -2.05637 -0.046041
C  -2.987098 -0.278549 -0.101597
C  3.081545 -0.814606 -0.654421
C  3.35676 -0.237625 0.604845
C  -2.264979 -2.93135 0.534708
C  -3.934339 -1.154598 0.477709
C  -3.580673 -2.484582 0.797638
H  -0.529717 -0.267979 -2.119304
H  -0.202591 2.12269 -1.921188
H  -1.906838 1.606846 -2.070611
H  -0.888075 3.391633 1.554738
H  0.451137 3.236954 0.37537
H  -0.855776 0.819545 1.76671
H  0.466457 1.74248 2.522675
H  1.571417 -1.111891 -2.156424
H  -1.424779 4.386744 -1.212527
H  -2.515103 4.253441 0.211268
H  -2.966398 3.471787 -1.333058
H  2.631717 0.913214 2.289202
H  -0.304034 -2.414526 -0.241104
H  -3.257956 0.761473 -0.300595
H  -1.9741 -3.959256 0.780368
H  -4.948419 -0.793309 0.685273
H  -4.315759 -3.160989 1.248452
H  4.887506 -1.555983 -0.92014
