program: Gaussian 09
title: 000048802
version: EM64L-G09RevD.01
frameworkgroup: C1[X(C12H18N2O3)]
method: RPBEPBE
basis: SDD
operation: Freq
keyword: #p
keyword: freq=noraman
keyword: PBEPBE/SDD
title: #p freq=noraman PBEPBE/SDD
converged: YES YES NO NO
title: Mulliken charges:
elementType: O O O N N C C C C C C C C C C C C H H H H H H H H H H H H H H H H H H
charge: -0.214888 -0.213234 -0.239076 -0.203733 -0.371356 0.141029 -0.416552 -0.547668 0.210087 0.114722 -0.724133 -0.284540 0.175452 0.397142 -0.593083 -0.786791 -0.794594 0.248405 0.222541 0.258879 0.227065 0.232031 0.232995 0.220770 0.229743 0.362558 0.261506 0.252909 0.253071 0.217213 0.225955 0.230896 0.223694 0.225094 0.225887
chargesum: 0.00000
title: Mulliken charges with hydrogens summed into heavy atoms:
elementType: O O O N N C C C C C C C C C C C C
charge: -0.214888 -0.213234 -0.239076 -0.203733 -0.008797 0.141029 0.054394 -0.061724 0.210087 0.114722 -0.038337 -0.054797 0.175452 0.397142 0.174403 -0.112727 -0.119918
polarizability: 1.74385331e+02 1.61685909e+00 1.65949308e+02 1.38255510e+01 3.24297798e+00 1.21100987e+02
1716.lowfreq: -83.3100 -30.4735 -13.1321 -11.2842 -0.0004 -0.0004 0.0005 9.6346 29.2334
frequency: -83.2747 -21.7646 28.3424 47.7461 72.7858 84.0788 102.1149 110.6789 146.3279 154.8752 162.1169 186.0406 196.8580 211.6503 265.8409 291.9241 297.4065 329.9631 337.4279 368.2316 380.5110 391.0747 431.6129 436.6255 461.8498 495.4170 534.7193 578.0132 659.7945 662.4671 690.3304 709.8262 714.4609 759.8474 770.0853 782.9366 831.2711 851.7553 901.7475 931.7092 947.2374 970.6375 974.3159 988.3276 1023.0310 1046.5457 1081.0190 1086.4286 1114.5818 1128.2873 1135.2635 1147.1973 1170.4315 1213.3878 1233.5521 1255.6349 1288.6278 1310.7121 1311.8297 1335.8597 1360.2004 1361.9879 1375.0629 1387.2614 1390.2082 1396.7940 1425.0563 1449.7139 1452.9629 1455.7552 1463.8329 1467.8359 1471.7509 1478.7097 1482.5773 1485.5525 1489.0416 1591.1784 1640.7153 1653.8045 1686.9058 2962.8523 2968.1380 2984.9855 2988.8079 3015.6701 3016.0911 3035.4498 3039.0050 3050.7499 3069.7632 3080.8695 3084.3449 3090.0418 3094.4501 3103.4153 3111.8611 3149.7099 3518.6568
redmass: 1.0377 2.6983 5.7702 4.1958 3.0029 2.7939 2.4110 1.1879 4.7964 7.4957 1.8565 1.5830 4.2312 1.4092 3.9058 3.3171 1.8959 2.2775 3.4258 7.5932 7.4253 2.4093 6.0278 2.6899 5.6150 3.1159 3.1238 6.5365 3.2735 2.7608 5.6192 7.0337 5.2279 1.9224 1.5872 2.1805 2.1399 1.6986 2.7045 3.2013 1.3985 2.2697 1.9863 1.2545 1.8100 2.5758 1.6906 2.3431 1.9391 1.3843 2.5379 2.1365 4.2830 2.5959 3.0641 1.4483 1.3098 1.6008 2.5979 1.5323 2.4976 1.7746 1.9612 1.3182 1.2106 1.2282 1.2035 1.0835 1.0575 1.0832 1.1033 1.0648 1.0572 1.0901 1.0508 1.0424 1.0715 10.7772 6.0626 8.1398 6.2906 1.0373 1.0382 1.0356 1.0592 1.0604 1.0357 1.0970 1.0963 1.1014 1.1004 1.0984 1.0984 1.0963 1.1026 1.0908 1.0985 1.1036 1.0768
irintensity: 0.0721 0.0745 0.2108 1.0344 0.3695 0.7286 1.2548 0.0233 3.5341 9.1684 1.1338 0.6193 0.1147 1.0205 3.5520 1.5047 3.2064 1.6637 0.9665 25.4373 20.6677 1.2539 12.0222 6.2666 7.8613 1.7233 5.4816 3.3004 9.3830 18.4267 15.5192 1.7650 0.7419 13.4131 64.0019 27.1105 8.9911 17.1006 16.3672 24.2293 0.4230 3.7156 30.7351 4.6109 10.0424 46.0155 2.9819 3.7542 11.4335 2.5861 0.3583 3.3436 44.3087 9.5770 9.6896 15.8460 4.6710 65.8023 171.3853 52.6940 96.2313 62.5605 24.9577 24.9952 18.3495 9.8573 96.4284 21.8330 1.4289 9.8275 34.8135 21.3769 11.7720 16.3184 6.3545 20.0750 18.7028 343.1580 372.3642 210.3408 20.0513 30.1524 40.2674 27.8588 11.8755 15.7974 19.2333 0.2422 46.4293 9.2048 2.2509 34.9096 19.1440 35.1490 21.6113 37.7704 12.2295 0.7396 64.6632
temp: 298.150 k
press: 1.00000 atm
elementType: 8 8 8 7 7 6 6 6 6 6 6 6 6 6 6 6 6 1 1 1 1 1 1 1 1 1 1 1 1 1 1 1 1 1 1
symmnumber: 1
zpe: 750448.2 jmol-1
zpe.correction: 0.285831 hartree
zpe.thermalcorrener: 0.303144 hartree
zpe.thermalcorrenthalpy: 0.304088 hartree
zpe.thermalcorrgfe: 0.240646 hartree
zpe.sumelectzpe: -801.981833 hartree
zpe.sumelectthermal: -801.964520 hartree
zpe.sumelectthermalent: -801.963576 hartree
zpe.sumelectthermalfe: -802.027017 hartree
dipole: 2.3258 0.8078 0.0842
dipole: 2.4635
quadrupole: -102.2355 -106.3465 -106.0428
quadrupole: 2.7913 -5.1296 -0.8500
quadrupole: 2.6395 -1.4716 -1.1679 2.7913 -5.1296 -0.8500
hfenergy: -802.2676639 hartree
pointgroup: C01 [X(C12H18N2O3)]
dipole: -0.9482106 -0.1980815 0.0322259 debye
polarizability: 174.9944773|-0.2019738|165.3906461|-13.4724118|-3.8709868|121.0505019 unknown
InChI: InChI=1S/C12H18N2O3/c1-5-12(7-6-8(2)3)9(15)13-11(17)14(4)10(12)16/h6,13H,5,7H2,1-4H3
charge 0 multiplicity 1
35 atoms
O  -0.616322 -0.063033 1.85818
O  2.337351 1.647572 -1.526379
O  2.334085 -2.856862 -0.432861
N  0.748404 -1.495403 0.643033
N  2.267994 -0.5924 -0.958259
C  0.459793 0.900578 -0.120728
C  0.432338 2.287537 0.57834
C  -0.68185 0.822451 -1.254233
C  0.171072 -0.217473 0.889288
C  1.766434 0.718329 -0.89779
C  1.551253 2.486403 1.62233
C  -2.082596 1.08763 -0.760723
C  1.805619 -1.727268 -0.263251
C  -3.076486 0.171742 -0.566143
C  0.317842 -2.634143 1.489274
C  -4.446576 0.611039 -0.07953
C  -2.933764 -1.323696 -0.78377
H  -0.550139 2.393432 1.068606
H  0.514883 3.05949 -0.208428
H  -0.393574 1.591959 -1.996329
H  -0.609908 -0.159687 -1.756618
H  1.476394 1.743013 2.436368
H  2.553383 2.41584 1.162407
H  1.467859 3.487989 2.080809
H  -2.315166 2.140786 -0.550601
H  3.08304 -0.754743 -1.558873
H  0.491746 -3.566997 0.934032
H  -0.74714 -2.505227 1.731365
H  0.894019 -2.659758 2.430058
H  -5.23925 0.309228 -0.79244
H  -4.689021 0.130505 0.888884
H  -4.504104 1.704264 0.057931
H  -1.94931 -1.62122 -1.180683
H  -3.709127 -1.692122 -1.483542
H  -3.089076 -1.862356 0.172173
