program: Gaussian 09
title: 000005044
version: EM64L-G09RevD.01
frameworkgroup: C1[X(C22H21N3O3)]
method: RPBEPBE
basis: SDD
operation: Freq
keyword: #p
keyword: freq=noraman
keyword: PBEPBE/SDD
title: #p freq=noraman PBEPBE/SDD
converged: YES YES NO NO
title: Mulliken charges:
elementType: O O O N N N C C C C C C C C C C C C C C C C C C C C C C H H H H H H H H H H H H H H H H H H H H H
charge: -0.301685 -0.268161 -0.291723 -0.376446 -0.482992 -0.710293 0.509465 -0.537623 0.266923 -0.385799 -0.450661 -0.358571 -0.357090 0.115605 0.348902 0.169809 0.473854 -0.419688 -0.330663 0.308379 -0.342222 -0.239280 -0.403328 -0.370445 -0.233277 -0.223850 -0.223874 -0.231994 0.266066 0.231870 0.247757 0.236234 0.222318 0.276044 0.326119 0.337668 0.230661 0.233210 0.301923 0.219743 0.226888 0.234065 0.234844 0.224849 0.228788 0.228128 0.230948 0.304545 0.304063
chargesum: 0.00000
title: Mulliken charges with hydrogens summed into heavy atoms:
elementType: O O O N N N C C C C C C C C C C C C C C C C C C C C C C
charge: -0.301685 -0.268161 -0.291723 -0.050327 -0.145324 -0.101685 0.509465 -0.039687 0.266923 -0.138042 -0.214427 -0.136253 -0.081046 0.115605 0.348902 0.169809 0.473854 0.044183 -0.028740 0.308379 -0.122479 -0.012392 -0.169264 -0.135601 -0.008428 0.004938 0.004253 -0.001047
polarizability: 3.97309015e+02 -4.98124196e+01 2.68414502e+02 -1.11703310e+01 -1.59312889e+01 1.99607307e+02
1716.lowfreq: -4.8098 -2.6267 -0.0003 0.0006 0.0012 3.7159 7.7467 12.2511 14.0752
frequency: 7.1670 11.9116 13.8410 17.7080 29.4959 34.8101 45.6627 54.7812 64.3127 90.7873 102.0730 122.2055 150.3751 166.4270 187.8453 190.3837 233.8969 242.3733 247.3923 286.7510 287.8967 307.1275 315.0249 324.3127 358.5101 403.0678 404.6443 430.7536 441.0855 457.1079 460.0016 494.1419 541.6605 550.0251 554.2465 557.1658 583.6291 603.1771 617.5878 628.6702 632.1399 643.1822 678.6050 685.9331 698.5179 703.4214 725.3421 748.6592 757.3122 759.8673 768.8464 782.3767 809.3411 827.0813 834.0987 851.7015 854.1610 860.7054 864.9029 873.6544 877.9520 923.8009 931.9821 940.8243 953.9186 965.1910 977.7098 981.1189 990.8916 991.8445 998.0726 1010.3968 1024.0524 1027.2282 1031.9307 1056.9097 1088.3444 1090.5636 1101.0062 1124.3744 1130.1982 1170.3455 1173.1549 1186.0221 1190.4767 1192.4208 1194.7343 1211.9655 1220.0764 1227.7160 1243.5343 1250.1587 1294.1151 1302.3967 1313.1011 1323.5884 1341.7578 1353.0863 1386.5348 1389.4697 1391.5917 1409.1363 1441.0078 1448.7207 1464.7724 1471.6118 1474.7660 1486.4977 1491.1346 1502.9801 1513.2173 1566.3635 1596.9616 1597.6818 1602.8651 1613.7186 1617.7672 1621.5666 1644.9494 1656.9680 2984.9334 3010.9694 3042.9402 3074.0565 3116.4278 3120.4920 3122.3117 3124.3793 3124.4101 3136.8435 3139.7993 3147.2998 3149.1874 3161.6523 3162.1262 3165.5623 3193.0271 3460.8850 3475.1116 3567.1270 3608.3350
redmass: 4.9724 5.1153 4.5044 4.2479 5.8473 4.0036 7.5244 5.2234 5.9253 5.2697 5.1859 5.8880 6.0240 4.5703 5.1574 3.5172 5.0777 3.0023 4.9001 2.6705 3.7766 2.6908 2.4866 3.4092 4.1490 2.7976 2.8725 3.2595 4.2385 3.1394 4.3764 3.6141 6.0207 3.5015 5.1184 3.6653 2.2905 1.9018 6.3234 1.9597 3.4716 2.8729 5.9328 4.4318 9.5635 1.8146 3.1634 3.1079 1.2832 2.0673 2.1537 2.0387 3.6839 3.7351 2.0358 2.8211 1.2518 1.4035 1.5157 3.3287 4.9746 2.5365 2.2664 1.3655 1.6673 1.4080 1.3922 1.3074 6.0625 1.4045 1.3257 3.1289 2.3947 2.2051 2.1450 1.9109 1.5252 3.0529 4.0741 1.4415 1.4136 1.0653 1.0540 1.1701 1.0991 1.4264 1.5171 2.0411 2.1832 2.3795 1.5498 2.3236 2.0282 1.5577 1.5135 1.2842 1.6396 1.4745 8.4135 3.3206 5.9415 2.8610 2.1957 2.7323 1.1321 2.2218 1.1160 2.2573 1.9599 2.6492 2.5358 6.8157 6.1726 6.6908 4.5766 5.3098 6.2241 6.0229 1.2208 9.3022 1.0613 1.0577 1.1001 1.1079 1.0880 1.0876 1.0853 1.0885 1.0892 1.0919 1.0898 1.0951 1.0964 1.0978 1.0950 1.1017 1.0953 1.0751 1.0474 1.0775 1.0972
irintensity: 0.0626 2.5727 0.5159 0.1054 0.5614 2.2769 3.5159 0.2335 3.9056 2.7623 4.1028 1.5845 1.8599 0.0362 3.1696 10.3399 1.2563 34.0536 20.9650 9.4654 2.1546 15.5515 2.0835 24.1028 3.1927 0.2860 2.2685 5.9173 9.3462 14.1973 4.3570 9.7989 10.7715 11.1849 7.2415 3.2820 112.2861 71.8744 0.5188 94.5073 45.8113 69.5568 17.2171 19.7511 21.9265 52.5242 5.6008 7.3143 103.3046 59.1295 66.0041 66.4553 3.6193 22.8623 8.1771 13.1219 0.1076 0.4626 11.8477 20.3047 10.5356 134.0080 52.7899 7.8167 1.3492 9.7968 0.0192 1.5771 1.3571 8.1543 0.0866 4.0168 96.4541 7.2995 12.6838 17.7541 10.5021 49.8034 112.5699 53.6569 3.3372 1.7439 0.0590 51.3408 11.2684 158.7210 223.9196 1.5305 7.2616 13.4088 62.2918 130.6019 32.5104 38.8014 38.4671 0.7899 20.6068 9.1405 0.3962 4.0527 47.5754 6.1680 10.3416 163.2996 39.3967 137.9319 29.6807 63.6773 360.0931 94.7237 308.4582 51.5436 0.7773 55.7365 67.1889 3.5806 0.1152 10.7578 50.5427 305.3768 42.1156 24.4301 13.3640 14.7461 18.7398 11.2205 5.4100 0.7206 17.6616 14.4603 15.9156 10.3018 40.6609 33.6851 2.2196 21.0715 5.3771 41.4742 8.4964 31.7379 17.2841
temp: 298.150 k
press: 1.00000 atm
elementType: 8 8 8 7 7 7 6 6 6 6 6 6 6 6 6 6 6 6 6 6 6 6 6 6 6 6 6 6 1 1 1 1 1 1 1 1 1 1 1 1 1 1 1 1 1 1 1 1 1
symmnumber: 1
zpe: 1016018.4 jmol-1
zpe.correction: 0.386981 hartree
zpe.thermalcorrener: 0.412438 hartree
zpe.thermalcorrenthalpy: 0.413382 hartree
zpe.thermalcorrgfe: 0.324209 hartree
zpe.sumelectzpe: -1238.925573 hartree
zpe.sumelectthermal: -1238.900116 hartree
zpe.sumelectthermalent: -1238.899172 hartree
zpe.sumelectthermalfe: -1238.988345 hartree
dipole: -1.9015 -2.4547 1.8389
dipole: 3.6087
quadrupole: -154.3508 -149.8893 -163.8747
quadrupole: -11.7188 27.7828 -7.0718
quadrupole: 1.6875 6.1490 -7.8365 -11.7188 27.7828 -7.0718
hfenergy: -1239.3125539 hartree
pointgroup: C01 [X(C22H21N3O3)]
dipole: 0.7497519 0.9797499 0.7026755 debye
polarizability: 396.1018209|-50.7681497|270.2092183|14.8362083|13.2289238|199.0197849 unknown
InChI: InChI=1S/C22H21N3O3/c23-19-8-4-5-9-20(19)25-21(26)18-12-10-16(11-13-18)14-24-22(27)28-15-17-6-2-1-3-7-17/h1-13,24-25H,14-15,23H2
charge 0 multiplicity 1
49 atoms
O  4.504597 -0.605158 0.283402
O  -4.532697 -1.599125 -1.592767
O  3.545528 -1.591012 2.205022
N  2.701249 -1.965809 0.03986
N  -4.295351 0.10105 0.0067
N  -4.935033 1.79403 2.043491
C  0.226615 -2.354396 0.113693
C  1.622727 -2.878499 0.439072
C  -2.413984 -1.406205 -0.417597
C  -0.140657 -1.02335 0.43551
C  -0.736076 -3.196128 -0.496442
C  -1.442954 -0.553024 0.174164
C  -2.038357 -2.728369 -0.76292
C  -3.827345 -0.981681 -0.733073
C  -5.526468 0.796535 -0.121873
C  -5.829254 1.719854 0.930752
C  6.380741 0.932969 0.309812
C  5.515183 0.052423 1.176992
C  -6.405257 0.665869 -1.225137
C  3.569326 -1.414758 0.957587
C  -6.962417 2.556851 0.812601
C  -7.543528 1.497025 -1.314116
C  7.656446 0.490043 -0.119426
C  5.93015 2.217792 -0.087292
C  -7.812102 2.457628 -0.312114
C  8.468561 1.313195 -0.932054
C  6.736784 3.041824 -0.902016
C  8.009515 2.591137 -1.325836
H  1.734934 -3.017663 1.531106
H  1.76901 -3.868595 -0.03496
H  0.602201 -0.354664 0.884765
H  -0.463958 -4.223911 -0.766634
H  -1.676154 0.494411 0.402687
H  -2.78552 -3.364678 -1.248061
H  2.826294 -1.719352 -0.942888
H  -3.675994 0.511147 0.715241
H  6.096605 -0.739735 1.680927
H  4.96578 0.62309 1.947209
H  -6.178197 -0.074352 -1.994543
H  -7.189729 3.269149 1.615362
H  -8.215448 1.396035 -2.172939
H  8.01312 -0.502469 0.18173
H  4.94407 2.568669 0.240106
H  -8.689175 3.109013 -0.390599
H  9.454042 0.960317 -1.255594
H  6.378352 4.032527 -1.202911
H  8.638095 3.231662 -1.954658
H  -4.792925 0.932787 2.579472
H  -5.018846 2.626397 2.629187
