program: Gaussian 09
title: 000048777
version: EM64L-G09RevD.01
frameworkgroup: C1[X(C11H18N2O3S)]
method: RPBEPBE
basis: SDD
operation: Freq
keyword: #p
keyword: freq=noraman
keyword: PBEPBE/SDD
title: #p freq=noraman PBEPBE/SDD
converged: YES YES NO NO
title: Mulliken charges:
elementType: S O O O N N C C C C C C C C C C C H H H H H H H H H H H H H H H H H H
charge: 0.141579 -0.249317 -0.209429 -0.234282 -0.190294 -0.363461 0.118496 -0.398482 -0.781433 0.239470 0.159227 -0.704567 -0.349894 0.191997 -0.593296 -0.625748 -0.663093 0.252256 0.216864 0.289963 0.286829 0.223783 0.253812 0.221446 0.366538 0.299860 0.260791 0.253133 0.260226 0.210279 0.221041 0.226402 0.214844 0.232162 0.222299
chargesum: 0.00000
title: Mulliken charges with hydrogens summed into heavy atoms:
elementType: S O O O N N C C C C C C C C C C C
charge: 0.141579 -0.249317 -0.209429 -0.234282 -0.190294 0.003076 0.118496 0.070639 -0.204641 0.239470 0.159227 -0.005525 -0.050034 0.191997 0.180853 0.031974 0.006212
polarizability: 1.75345408e+02 -5.39341724e+00 1.60423423e+02 -1.09990557e+01 -2.61201843e+00 1.42385054e+02
1716.lowfreq: -72.6440 -6.8854 -4.4849 -0.0016 0.0004 0.0018 7.2429 27.5656 34.7172
frequency: -72.6200 27.4459 34.6457 49.6264 59.3414 80.1770 86.2061 122.0412 134.9173 156.8157 180.8335 192.0306 204.1929 234.5698 243.3371 265.0747 276.6179 291.5245 326.3067 333.9553 341.7185 366.2637 377.7941 408.4239 425.9960 450.3603 472.8739 572.3872 575.9810 651.1646 660.5845 680.0935 701.2138 707.4152 714.6792 775.5125 776.6384 821.4482 881.9939 882.7947 925.8654 943.6179 948.7653 984.9439 1009.9922 1051.7589 1059.5212 1063.9751 1104.4170 1128.0380 1135.2632 1160.8503 1168.2394 1170.2225 1221.4025 1245.9039 1256.5424 1264.2400 1298.7363 1324.8513 1329.8497 1334.2414 1361.6242 1379.1886 1380.2960 1395.2665 1397.5560 1415.2069 1427.0614 1459.3722 1462.3089 1464.2975 1467.7261 1472.9409 1473.1873 1480.5685 1489.1215 1490.1914 1583.2742 1645.6543 1656.4385 2971.0011 2978.3363 2981.5053 2993.9791 3017.8916 3041.4637 3042.1187 3056.4490 3062.5042 3072.3103 3084.2107 3085.0820 3092.0549 3100.4185 3114.8718 3137.5018 3153.6413 3518.4963
redmass: 1.0407 5.9281 3.1776 3.5766 4.3661 2.3734 4.2260 5.2123 3.7878 8.3410 3.0507 2.4161 1.0526 1.5600 1.3811 2.5407 2.2350 3.8991 3.0214 2.9868 3.3501 6.8653 6.3681 2.9098 6.3737 6.1413 5.0711 6.9720 3.6979 2.9308 4.0578 4.8097 6.2594 6.7937 5.3607 1.4812 1.6418 1.9257 2.7377 3.3737 1.1820 2.9436 1.3657 1.9570 1.8694 2.5883 2.1918 1.7050 1.9421 1.3465 2.4679 1.9472 2.3375 4.2433 1.6454 1.3373 1.9143 1.3029 1.4810 1.7330 1.3539 2.3474 4.5352 1.2440 1.8648 1.2064 1.1992 1.0965 1.2327 1.0466 1.0481 1.0985 1.0949 1.0437 1.0469 1.0482 1.0520 1.0680 9.9164 6.3311 7.9349 1.0364 1.0357 1.0598 1.0367 1.0357 1.0879 1.1015 1.0573 1.0977 1.0985 1.0990 1.1002 1.0991 1.1004 1.0982 1.1073 1.1037 1.0767
irintensity: 0.0245 0.4342 0.4726 0.9264 0.4664 0.6227 1.7361 0.3969 0.4202 11.1793 3.1288 0.5311 0.0926 0.8670 0.2428 0.1020 3.2388 4.2384 0.3092 2.7393 0.9531 26.0306 32.9068 2.6872 6.3680 5.1865 20.9212 4.3566 6.7727 14.4351 3.9167 2.2590 3.8757 0.5211 11.7702 44.9046 81.2185 5.1653 1.1644 4.1176 2.6529 4.4655 0.1396 10.6030 18.3460 7.6002 53.9701 9.6170 18.5563 6.4243 1.8545 31.9911 11.3969 30.0740 11.9775 6.4703 31.6071 4.1462 39.1095 77.8982 0.2997 185.7019 159.5739 22.9267 7.2549 16.5291 32.7963 23.1007 123.2006 5.5957 1.7880 15.3826 18.9019 20.2586 2.6858 9.8556 14.0758 14.1629 343.4506 349.0710 233.7052 32.0123 34.8292 20.0343 22.4220 19.0183 0.6002 5.6936 10.4967 17.8781 34.5328 33.4408 19.8883 40.2427 24.1301 11.4480 0.8960 0.4319 67.6293
temp: 298.150 k
press: 1.00000 atm
elementType: 16 8 8 8 7 7 6 6 6 6 6 6 6 6 6 6 6 1 1 1 1 1 1 1 1 1 1 1 1 1 1 1 1 1 1
symmnumber: 1
zpe: 742171.3 jmol-1
zpe.correction: 0.282678 hartree
zpe.thermalcorrener: 0.301478 hartree
zpe.thermalcorrenthalpy: 0.302422 hartree
zpe.thermalcorrgfe: 0.234826 hartree
zpe.sumelectzpe: -1161.931623 hartree
zpe.sumelectthermal: -1161.912823 hartree
zpe.sumelectthermalent: -1161.911878 hartree
zpe.sumelectthermalfe: -1161.979474 hartree
dipole: -0.2801 0.4770 3.0210
dipole: 3.0712
quadrupole: -109.0195 -108.5192 -116.9023
quadrupole: 6.4517 1.6566 3.0515
quadrupole: 2.4608 2.9611 -5.4219 6.4517 1.6566 3.0515
hfenergy: -1162.2143007 hartree
pointgroup: C01 [X(C11H18N2O3S1)]
dipole: -0.0433702 -1.2060041 0.0604804 debye
polarizability: 174.2413369|13.3125063|143.4721744|-3.6850395|0.986272|160.4403737 unknown
InChI: InChI=1S/C11H18N2O3S/c1-5-11(6-17-7(2)3)8(14)12-10(16)13(4)9(11)15/h7,12H,5-6H2,1-4H3
charge 0 multiplicity 1
35 atoms
S  -2.128703 1.198526 0.134428
O  -0.267276 -1.761179 -0.44932
O  0.654168 2.258554 2.06709
O  3.127099 1.17996 -1.699939
N  1.499487 -0.368063 -1.018901
N  1.873716 1.652189 0.19955
C  0.255828 0.009424 1.157205
C  0.993136 -0.80114 2.310212
C  -1.253256 0.156919 1.458249
C  0.440564 -0.755758 -0.163941
C  0.905364 1.402808 1.180653
C  0.41534 -2.196547 2.619111
C  -3.173277 -0.149836 -0.758225
C  2.226909 0.837937 -0.891472
C  1.790687 -1.19868 -2.213401
C  -4.374537 -0.56905 0.105714
C  -3.595919 0.449642 -2.11055
H  0.943066 -0.163381 3.213331
H  2.0645 -0.891654 2.040788
H  -1.389815 0.669709 2.422612
H  -1.734547 -0.831456 1.476835
H  -0.605605 -2.133222 3.03408
H  0.376365 -2.837692 1.722451
H  1.050254 -2.694229 3.374327
H  2.365959 2.550499 0.2470
H  -2.481674 -0.997099 -0.908114
H  2.869579 -1.155312 -2.420701
H  1.242606 -0.818778 -3.092556
H  1.463383 -2.226535 -2.00317
H  -4.946905 -1.368544 -0.404664
H  -4.057954 -0.959247 1.089804
H  -5.049358 0.288133 0.278963
H  -4.206889 -0.284203 -2.669156
H  -2.719445 0.713143 -2.727757
H  -4.20775 1.359963 -1.96844
