program: Gaussian 09
title: 000048783
version: EM64L-G09RevD.01
frameworkgroup: C1[X(C10H14N2O3)]
method: RPBEPBE
basis: SDD
operation: Freq
keyword: #p
keyword: freq=noraman
keyword: PBEPBE/SDD
title: #p freq=noraman PBEPBE/SDD
converged: YES YES NO NO
title: Mulliken charges:
elementType: O O O N N C C C C C C C C C C H H H H H H H H H H H H H H
charge: -0.206159 -0.217000 -0.219963 -0.372300 -0.377413 0.106718 -0.617587 -0.402686 0.148775 0.162139 0.567561 -0.722134 0.152142 -0.833123 -0.722102 0.270080 0.224171 0.221270 0.251744 0.230049 0.233047 0.224350 0.366648 0.363775 0.230709 0.268999 0.216602 0.223646 0.228045
chargesum: 0.00000
title: Mulliken charges with hydrogens summed into heavy atoms:
elementType: O O O N N C C C C C C C C C C
charge: -0.206159 -0.217000 -0.219963 -0.005651 -0.013638 0.106718 -0.123337 0.070328 0.148775 0.162139 0.567561 -0.034689 0.152142 -0.116815 -0.270411
polarizability: 1.59282356e+02 1.58271957e+01 1.26917834e+02 6.10299277e+00 -9.50292024e+00 1.02746594e+02
1716.lowfreq: -4.8336 -0.0012 -0.0009 -0.0007 5.1992 12.9671 23.7124 31.3324 96.6345
frequency: 22.5202 31.0431 96.5104 109.9575 127.9056 141.2583 155.1161 166.7660 183.4913 194.7207 207.3828 225.2427 307.3545 357.5886 365.3406 384.6017 402.4743 431.3344 444.6476 482.8175 536.9212 590.3491 626.6988 650.0182 662.2539 691.1204 712.0076 742.4943 753.6781 771.4754 785.9897 829.8968 880.9720 920.5699 945.9863 959.2901 976.9964 983.9665 993.0972 1026.4865 1055.6011 1086.7652 1119.1089 1143.5165 1184.2550 1238.0241 1286.1932 1298.5280 1308.2095 1320.9833 1343.3359 1363.3017 1375.5311 1376.0423 1393.4807 1396.5886 1429.1645 1454.1858 1458.1617 1472.4606 1481.4318 1484.3727 1486.3592 1615.2601 1649.9049 1662.2447 1676.6814 2974.2694 2982.3051 2985.1740 3021.7380 3055.8099 3060.6702 3071.2738 3082.5989 3090.7772 3092.4639 3097.8735 3193.8392 3518.5212 3520.7266
redmass: 3.1308 6.8211 2.6051 2.3589 4.2748 6.1956 4.3338 2.1037 1.7214 1.6349 3.8655 2.6279 2.1965 11.7992 6.5917 2.6060 2.5534 2.8278 3.7756 9.0826 3.2305 5.4849 3.9919 2.5892 1.6480 2.9488 4.2994 1.7725 1.6790 1.5284 1.7234 3.0389 2.0109 3.8206 1.3510 1.9479 2.2199 1.7101 3.2551 1.4879 1.5168 2.8300 1.9852 2.3003 3.5908 1.8023 1.3652 2.5860 2.3706 1.4081 1.4703 7.6368 1.6611 1.7999 1.2090 1.2155 1.1875 1.0812 1.0766 1.0754 1.0523 1.0643 1.0416 6.9046 7.6906 5.0244 5.5359 1.0404 1.0591 1.0361 1.0615 1.1010 1.0940 1.1000 1.0981 1.0673 1.0946 1.1025 1.1143 1.0760 1.0780
irintensity: 0.0178 0.5577 0.7308 0.2019 0.5116 0.8483 11.5043 1.2241 1.1863 0.7662 0.1172 2.0811 3.3211 25.6165 5.6712 6.2107 4.8007 11.2680 7.6653 14.9839 7.5520 1.3920 5.4023 6.7937 22.8001 13.9753 13.5403 16.7027 1.9427 29.6093 169.1069 8.2092 1.9926 16.6997 73.3615 4.7203 9.3015 3.1438 5.6165 14.8127 10.6405 10.6507 8.2285 2.4496 37.8462 39.1483 27.7720 194.9951 65.5641 38.5134 42.7900 213.4926 11.7380 5.0272 19.1276 20.4057 2.6830 22.4234 1.4017 31.1553 6.5517 20.5890 18.9174 299.3202 103.3245 5.4455 609.5482 20.7028 27.7387 22.2209 10.2448 7.0616 16.6551 7.2582 30.8158 12.8257 9.2200 17.8825 19.7993 80.5520 48.4506
temp: 298.150 k
press: 1.00000 atm
elementType: 8 8 8 7 7 6 6 6 6 6 6 6 6 6 6 1 1 1 1 1 1 1 1 1 1 1 1 1 1
symmnumber: 1
zpe: 608815.9 jmol-1
zpe.correction: 0.231886 hartree
zpe.thermalcorrener: 0.247338 hartree
zpe.thermalcorrenthalpy: 0.248282 hartree
zpe.thermalcorrgfe: 0.188615 hartree
zpe.sumelectzpe: -723.533395 hartree
zpe.sumelectthermal: -723.517943 hartree
zpe.sumelectthermalent: -723.516999 hartree
zpe.sumelectthermalfe: -723.576666 hartree
dipole: 1.2505 -0.5075 -0.4473
dipole: 1.4217
quadrupole: -94.0695 -92.8791 -94.2401
quadrupole: -3.6463 -2.9289 3.1943
quadrupole: -0.3400 0.8505 -0.5105 -3.6463 -2.9289 3.1943
hfenergy: -723.7652809 hartree
pointgroup: C01 [X(C10H14N2O3)]
dipole: -0.4824335 0.2067312 -0.193347 debye
polarizability: 160.2492694|14.7329014|126.6229399|-4.6243216|9.5569578|102.074575 unknown
InChI: InChI=1S/C10H14N2O3/c1-4-10(5-6(2)3)7(13)11-9(15)12-8(10)14/h11-12H,2,4-5H2,1,3H3
charge 0 multiplicity 1
29 atoms
O  0.962687 -2.185045 -1.39676
O  -0.488302 0.897007 2.005355
O  3.528684 1.512051 -0.234373
N  2.187846 -0.309959 -0.829338
N  1.436318 1.24628 0.778452
C  -0.176638 -0.508237 0.002156
C  -1.052755 0.178033 -1.160063
C  -0.97895 -1.641505 0.695447
C  1.020538 -1.097464 -0.768926
C  0.222639 0.566398 1.022171
C  -2.410702 0.748435 -0.762617
C  -0.180792 -2.416364 1.764939
C  2.457265 0.869219 -0.112048
C  -2.462724 2.185482 -0.273732
C  -3.538412 0.002918 -0.920298
H  -1.194294 -0.623585 -1.907881
H  -0.43794 0.970949 -1.631363
H  -1.317169 -2.337611 -0.093287
H  -1.873711 -1.184344 1.149971
H  0.700632 -2.922101 1.330624
H  0.15325 -1.751772 2.581969
H  -0.818843 -3.196696 2.216274
H  2.946289 -0.647038 -1.431438
H  1.653507 2.040437 1.389806
H  -3.504351 2.520527 -0.133395
H  -1.937394 2.306336 0.690273
H  -1.978998 2.865955 -1.002129
H  -3.505905 -1.024954 -1.300662
H  -4.528275 0.40495 -0.675426
