program: Gaussian 09
title: 000048757
version: EM64L-G09RevD.01
frameworkgroup: C1[X(C11H18N2O3S)]
method: RPBEPBE
basis: SDD
operation: Freq
keyword: #p
keyword: freq=noraman
keyword: PBEPBE/SDD
title: #p freq=noraman PBEPBE/SDD
converged: NO YES NO NO
title: Mulliken charges:
elementType: S O O O N N C C C C C C C C C C C H H H H H H H H H H H H H H H H H H
charge: 0.153920 -0.207209 -0.237507 -0.219745 -0.364560 -0.373345 0.119078 -0.397023 -0.773854 0.183981 0.205239 -0.695261 -0.003699 -0.702585 0.158245 -0.676187 -0.686981 0.252224 0.219137 0.289103 0.286392 0.297703 0.242052 0.204891 0.223678 0.254036 0.223048 0.369193 0.365567 0.198942 0.211124 0.237713 0.206800 0.216361 0.219530
chargesum: 0.00000
title: Mulliken charges with hydrogens summed into heavy atoms:
elementType: S O O O N N C C C C C C C C C C C
charge: 0.153920 -0.207209 -0.237507 -0.219745 0.004633 -0.007779 0.119078 0.074338 -0.198359 0.183981 0.205239 -0.155506 0.201192 -0.001823 0.158245 -0.028408 -0.044290
polarizability: 1.87451467e+02 1.23170351e+01 1.45405470e+02 -2.83806860e+00 2.95657971e+00 1.46991790e+02
1716.lowfreq: -0.0018 -0.0009 0.0006 6.9110 12.0576 14.5878 28.3559 41.1335 44.6418
frequency: 28.1035 41.0599 44.2390 53.2762 78.7910 87.1636 114.8692 143.9422 150.7905 164.1298 183.8420 205.7350 217.0810 226.8816 247.7758 263.4937 286.7009 322.3126 330.8907 357.1733 359.5344 391.1599 409.4164 420.3064 456.7295 485.9048 584.8496 623.8047 649.5329 661.2140 673.5838 690.1579 707.3331 740.0106 754.9864 773.3338 788.5894 804.2802 819.6834 863.6775 918.8346 931.2573 947.4330 956.0769 989.2479 991.0658 1014.0091 1053.3359 1089.6031 1108.0289 1121.5644 1158.9020 1180.1985 1189.9387 1225.2890 1241.7955 1250.1362 1266.6241 1291.0613 1310.0116 1320.5298 1334.3097 1337.0022 1365.5707 1373.7198 1376.5926 1378.4351 1390.5607 1400.7433 1416.0294 1439.9839 1467.0713 1468.4022 1470.5815 1473.3241 1481.1218 1487.8652 1489.9806 1613.7903 1651.7279 1678.7561 2963.3512 2970.2203 2972.9326 2982.9118 2994.3678 3010.4917 3044.4679 3057.6567 3063.5966 3069.9657 3073.9798 3082.1018 3084.6911 3089.7861 3100.3637 3138.8399 3519.1382 3521.4689
redmass: 7.1090 3.5601 3.0443 5.2697 2.2490 4.4713 4.3963 4.7115 3.9003 8.6250 2.0653 1.9425 1.4653 2.0258 1.5024 1.5177 2.7561 2.9422 2.7918 7.8074 9.8227 2.3351 3.2630 3.0699 4.9129 9.1143 9.1286 3.9250 2.6403 2.9305 3.8102 4.4904 5.7791 4.9818 1.7615 1.3532 1.7190 2.4083 1.8946 1.5328 1.1992 3.3710 1.7589 1.4958 1.9096 3.4262 1.8582 3.5585 1.5209 1.8542 2.1441 2.8302 1.8275 2.2911 1.4126 1.5328 1.2395 1.1970 1.7009 1.4406 1.7007 1.6049 1.6463 8.3547 1.2084 1.5664 2.0629 1.2056 1.2023 1.1005 1.0870 1.0813 1.0457 1.0553 1.0425 1.0497 1.0515 1.0509 6.7494 8.5905 5.5156 1.0827 1.0356 1.0359 1.0599 1.0368 1.0586 1.1014 1.0574 1.0993 1.0993 1.0998 1.0995 1.0990 1.1057 1.1005 1.1075 1.0760 1.0778
irintensity: 0.3671 0.2002 0.0823 0.9459 0.1797 0.0908 0.2444 0.2890 3.6487 8.6416 1.2206 1.6990 1.1124 0.3428 0.7196 1.0513 1.2909 3.3400 2.7822 21.7043 22.8895 1.2813 2.1119 1.3417 30.2749 14.0480 1.1047 4.6933 1.1270 14.0670 15.6771 4.9056 6.0847 9.4408 5.2559 12.3734 224.3881 3.2393 7.6830 6.4470 6.2013 3.4281 15.2972 0.9431 8.6911 1.8051 10.6650 7.1144 0.6913 10.9215 1.9748 30.8523 19.3731 20.9975 7.5206 21.4756 17.3739 11.1984 92.1153 4.4226 82.7130 67.0403 83.4597 213.3091 22.8813 7.1126 4.1278 21.9795 23.2002 33.7673 4.5804 7.1368 2.3386 9.1734 14.0750 7.1128 14.0042 19.0305 276.4919 104.9694 634.1674 16.0571 30.6700 43.1617 21.0752 20.3570 16.6408 5.1285 8.1729 7.0030 57.1782 43.2613 36.7113 31.6177 13.7154 23.2827 0.9328 78.6062 54.2259
temp: 298.150 k
press: 1.00000 atm
elementType: 16 8 8 8 7 7 6 6 6 6 6 6 6 6 6 6 6 1 1 1 1 1 1 1 1 1 1 1 1 1 1 1 1 1 1
symmnumber: 1
zpe: 745256.7 jmol-1
zpe.correction: 0.283853 hartree
zpe.thermalcorrener: 0.302894 hartree
zpe.thermalcorrenthalpy: 0.303838 hartree
zpe.thermalcorrgfe: 0.235604 hartree
zpe.sumelectzpe: -1161.935469 hartree
zpe.sumelectthermal: -1161.916428 hartree
zpe.sumelectthermalent: -1161.915484 hartree
zpe.sumelectthermalfe: -1161.983718 hartree
dipole: 0.6718 2.6694 -0.8672
dipole: 2.8861
quadrupole: -110.3281 -109.3753 -119.4764
quadrupole: -6.6097 -3.0754 2.6175
quadrupole: 2.7318 3.6847 -6.4165 -6.6097 -3.0754 2.6175
hfenergy: -1162.2193224 hartree
pointgroup: C01 [X(C11H18N2O3S1)]
dipole: -0.2875387 1.0665529 -0.2627989 debye
polarizability: 187.9906921|-11.2161166|142.8105483|3.3276642|-0.2689375|149.0474868 unknown
InChI: InChI=1S/C11H18N2O3S/c1-4-11(6-17-5-7(2)3)8(14)12-10(16)13-9(11)15/h7,12-13H,4-6H2,1-3H3
charge 0 multiplicity 1
35 atoms
S  -1.384922 -1.445339 -0.18891
O  1.604857 -1.655708 -2.088113
O  -0.056461 1.626797 1.061829
O  3.714889 -0.913348 1.986089
N  2.655155 -1.225079 -0.074572
N  1.877378 0.421239 1.432075
C  0.792764 0.290281 -0.825021
C  1.420486 1.409149 -1.765809
C  -0.656258 -0.044263 -1.245974
C  1.679073 -0.952792 -1.049109
C  0.800522 0.81627 0.618652
C  -2.64361 -0.463834 0.850566
C  -3.952586 -0.125712 0.104155
C  0.630113 2.730476 -1.845288
C  2.816995 -0.592938 1.169814
C  -4.754505 -1.393885 -0.26286
C  -4.799011 0.84071 0.97172
H  1.501071 0.954251 -2.771362
H  2.454035 1.613088 -1.421382
H  -0.670232 -0.384296 -2.292597
H  -1.30388 0.835526 -1.119971
H  -2.12405 0.444263 1.20049
H  -2.842211 -1.118238 1.719551
H  -3.684804 0.401479 -0.836051
H  -0.357496 2.589636 -2.317716
H  0.469215 3.17853 -0.850296
H  1.193062 3.453539 -2.462727
H  3.291901 -2.006884 -0.260978
H  1.933033 0.842396 2.365417
H  -5.085787 -1.922391 0.652225
H  -5.655324 -1.13548 -0.849153
H  -4.139403 -2.09084 -0.859693
H  -5.082359 0.361497 1.928583
H  -5.731364 1.119831 0.4473
H  -4.244885 1.768673 1.205515
