program: Gaussian 09
title: 000048759
version: EM64L-G09RevD.01
frameworkgroup: C1[X(C13H22N2O4)]
method: RPBEPBE
basis: SDD
operation: Freq
keyword: #p
keyword: freq=noraman
keyword: PBEPBE/SDD
title: #p freq=noraman PBEPBE/SDD
converged: YES YES NO NO
title: Mulliken charges:
elementType: O O O O N N C C C C C C C C C C C C C H H H H H H H H H H H H H H H H H H H H H H
charge: -0.306608 -0.229605 -0.227674 -0.226917 -0.363742 -0.361077 0.088535 0.008772 -0.438456 0.171960 0.165912 -0.745591 -0.267383 -0.416840 -0.712614 -0.034033 0.164800 -0.709775 -0.709808 0.228585 0.229357 0.246425 0.272577 0.217192 0.228866 0.206455 0.204079 0.214005 0.211177 0.233547 0.228014 0.225760 0.207669 0.361368 0.360562 0.214058 0.206026 0.217738 0.203995 0.215120 0.217569
chargesum: 0.00000
title: Mulliken charges with hydrogens summed into heavy atoms:
elementType: O O O O N N C C C C C C C C C C C C C
charge: -0.306608 -0.229605 -0.227674 -0.226917 -0.002374 -0.000515 0.088535 0.237357 0.037327 0.171960 0.165912 -0.026956 0.143151 0.008342 -0.025292 0.173636 0.164800 -0.071953 -0.073124
polarizability: 1.67541296e+02 5.60459316e+00 1.75841226e+02 1.84513599e+00 -1.72665469e+00 1.51672998e+02
1716.lowfreq: -18.1871 -5.5539 -0.0004 -0.0001 0.0004 9.5675 17.1696 24.6891 31.2075
frequency: 10.3467 24.5900 31.1381 56.8381 67.8463 91.1838 95.4387 122.1292 123.8827 152.9646 157.9994 168.2218 187.0403 205.5548 216.9070 222.7817 229.2323 257.5943 296.9024 306.3548 321.5983 338.9493 357.0445 359.7328 370.9793 389.9632 438.3232 476.9587 484.1489 500.6584 550.2615 590.4213 634.2866 648.2213 679.5825 710.5759 726.6889 752.6121 779.2518 781.4274 784.7130 787.9627 836.8019 913.2936 926.8623 940.6210 952.5062 960.3045 965.3349 987.0346 990.6848 996.4831 1018.9982 1056.4320 1083.4387 1093.4972 1112.7436 1134.2406 1146.7101 1151.8074 1161.1288 1193.6210 1208.6085 1225.0063 1273.0681 1282.6364 1287.4223 1304.9085 1314.7575 1331.2749 1332.7472 1344.4554 1348.1726 1374.7583 1377.0857 1377.7327 1379.8268 1386.0431 1395.2576 1397.6570 1399.3351 1454.3230 1462.9753 1466.4647 1467.0735 1475.3404 1477.1545 1481.1021 1485.4291 1486.7222 1488.6324 1492.2480 1611.4614 1648.6198 1677.9779 2941.4477 2949.5697 2965.5682 2970.8694 2974.9405 2983.6093 2989.9457 2996.1578 3000.5128 3013.8905 3049.0702 3063.0305 3066.9872 3070.3511 3071.1127 3073.7580 3081.9967 3083.5767 3092.8216 3115.5526 3523.3726 3525.2089
redmass: 2.7541 4.7339 7.6262 3.9865 3.4236 1.8672 2.5024 2.4553 4.3431 5.0807 3.7800 7.2732 3.1802 1.2332 1.3351 1.3818 3.3751 1.0574 2.0071 2.5162 3.9136 3.4198 2.2219 8.2861 4.1081 4.0289 4.2314 3.3660 7.7604 4.1803 2.7264 7.9676 3.4439 2.6193 2.2805 5.3925 3.4074 1.7551 1.4571 2.3127 1.6371 1.4524 3.2472 1.1837 1.8169 2.6303 1.3043 3.1514 2.0612 2.7592 1.7258 3.3059 2.1242 2.3865 1.8311 3.4725 2.4678 2.1271 2.0676 2.4603 2.5794 1.8971 1.2343 3.6868 1.2772 1.1426 1.5299 2.1732 1.3229 1.4037 1.4520 1.3222 1.6412 7.0444 1.2120 1.5657 2.2172 1.4505 1.2155 1.2346 1.2112 1.0794 1.0772 1.0464 1.0628 1.0456 1.0542 1.0491 1.0663 1.0419 1.0527 1.0674 6.6462 8.4927 5.3838 1.0570 1.0836 1.0800 1.0356 1.0361 1.0362 1.0641 1.0652 1.0715 1.0602 1.1040 1.0995 1.1003 1.0998 1.0987 1.0991 1.0981 1.0989 1.1026 1.1000 1.0758 1.0779
irintensity: 0.0269 0.0753 0.3962 1.0820 0.9917 1.6652 0.1965 1.7182 0.3558 0.4290 3.4342 8.7011 2.9962 0.8732 0.3703 0.0675 0.5085 0.1263 1.6324 0.7787 3.9282 8.4528 1.7004 26.6292 6.0424 3.1809 3.9946 5.5795 20.0289 14.5623 0.9793 2.5907 4.4679 3.3264 33.3202 2.7531 5.5798 2.4613 16.7807 9.6447 204.1953 16.3451 5.4905 2.1716 4.1462 7.0680 0.1043 15.7156 13.8372 78.8202 3.1264 3.0519 17.7014 33.9686 95.2289 9.7419 15.7529 1.6029 8.2810 3.9981 7.7302 7.0248 0.2385 54.6830 33.8002 3.1278 28.1901 165.9634 37.6839 27.0167 2.0471 8.2338 83.8204 227.8124 15.8357 3.5184 7.5887 8.4468 11.5873 23.7322 25.3494 16.8532 6.3763 2.6204 10.8800 8.3629 3.6622 9.1039 19.0716 14.1638 10.8620 9.6705 284.9109 83.4663 579.0480 34.2071 21.5377 17.2679 33.9489 26.6329 22.8784 28.9072 8.7179 37.7092 19.0062 39.1035 13.0354 4.8009 28.9626 85.3723 79.6747 26.7506 33.9645 25.5354 8.5211 78.7174 40.8554
temp: 298.150 k
press: 1.00000 atm
elementType: 8 8 8 8 7 7 6 6 6 6 6 6 6 6 6 6 6 6 6 1 1 1 1 1 1 1 1 1 1 1 1 1 1 1 1 1 1 1 1 1 1
symmnumber: 1
zpe: 898583.8 jmol-1
zpe.correction: 0.342252 hartree
zpe.thermalcorrener: 0.363621 hartree
zpe.thermalcorrenthalpy: 0.364565 hartree
zpe.thermalcorrgfe: 0.290064 hartree
zpe.sumelectzpe: -917.530100 hartree
zpe.sumelectthermal: -917.508731 hartree
zpe.sumelectthermalent: -917.507787 hartree
zpe.sumelectthermalfe: -917.582288 hartree
dipole: 1.5618 -1.9430 0.5950
dipole: 2.5629
quadrupole: -106.7213 -120.7125 -124.6754
quadrupole: 0.9393 -2.5360 -0.1294
quadrupole: 10.6484 -3.3427 -7.3057 0.9393 -2.5360 -0.1294
hfenergy: -917.8723522 hartree
pointgroup: C01 [X(C13H22N2O4)]
dipole: -0.5971112 -0.7846999 -0.2107477 debye
polarizability: 167.4789959|-5.5886702|175.82695|2.8089843|0.0485269|151.7495748 unknown
InChI: InChI=1S/C13H22N2O4/c1-5-13(9(4)19-7-6-8(2)3)10(16)14-12(18)15-11(13)17/h8-9,14-15H,5-7H2,1-4H3
charge 0 multiplicity 1
41 atoms
O  -0.842337 -0.430591 0.290014
O  2.022261 -0.764835 2.357568
O  1.262768 -0.110378 -2.405978
O  1.301652 3.453956 0.566582
N  1.631379 1.304717 1.421917
N  1.344571 1.634131 -0.897826
C  1.50752 -0.735451 -0.046612
C  0.128543 -1.501875 -0.022466
C  2.679373 -1.719077 -0.362931
C  1.741035 -0.092251 1.330444
C  1.363785 0.268004 -1.209162
C  0.030434 -2.685236 0.949349
C  -2.243006 -0.753624 -0.042135
C  -3.045432 0.544936 0.110341
C  4.042978 -1.023213 -0.552648
C  -4.574771 0.402377 -0.135632
C  1.405573 2.216142 0.379087
C  -4.901505 -0.058426 -1.577966
C  -5.261375 -0.513083 0.908535
H  -0.041356 -1.851633 -1.065411
H  2.41231 -2.27312 -1.281647
H  2.746905 -2.437675 0.471812
H  0.250765 -2.378849 1.984062
H  -0.987216 -3.112785 0.909855
H  0.732818 -3.488356 0.665083
H  -2.620794 -1.538396 0.64412
H  -2.28637 -1.141586 -1.082477
H  -2.873838 0.932863 1.133458
H  -2.626686 1.292672 -0.590954
H  4.025402 -0.314711 -1.400408
H  4.350882 -0.476712 0.357713
H  4.823215 -1.774909 -0.765879
H  -4.997959 1.421057 -0.009112
H  1.720132 1.714031 2.357523
H  1.203447 2.286425 -1.675749
H  -5.990446 -0.017241 -1.764717
H  -4.575624 -1.101133 -1.753432
H  -4.402801 0.5839 -2.327697
H  -4.956698 -1.569773 0.786876
H  -6.360958 -0.473514 0.799676
H  -5.010577 -0.203378 1.940323
