program: Gaussian 09
title: 000048799
version: EM64L-G09RevD.01
frameworkgroup: C1[X(C13H20N2O3)]
method: RPBEPBE
basis: SDD
operation: Freq
keyword: #p
keyword: freq=noraman
keyword: PBEPBE/SDD
title: #p freq=noraman PBEPBE/SDD
converged: YES YES NO NO
title: Mulliken charges:
elementType: O O O N N C C C C C C C C C C C C C H H H H H H H H H H H H H H H H H H H H
charge: -0.194024 -0.194834 -0.219848 -0.374188 -0.373906 0.000060 -0.448854 0.370725 0.130502 0.129962 -0.275139 -0.468523 -0.729112 -0.843669 -0.345427 0.167854 -0.345977 -0.694053 0.245167 0.243530 0.238501 0.200790 0.202283 0.228565 0.230815 0.230738 0.243520 0.246013 0.238117 0.193827 0.210532 0.362740 0.362739 0.194070 0.196098 0.216961 0.212607 0.210839
chargesum: 0.00000
title: Mulliken charges with hydrogens summed into heavy atoms:
elementType: O O O N N C C C C C C C C C C C C C
charge: -0.194024 -0.194834 -0.219848 -0.011447 -0.011167 0.000060 0.039843 0.370725 0.130502 0.129962 -0.036638 -0.065450 -0.038994 -0.116019 0.058932 0.167854 0.044191 -0.053647
polarizability: 2.12040501e+02 2.17629364e+01 1.43582963e+02 1.36764541e+00 -3.66359005e+00 1.40055570e+02
1716.lowfreq: -15.9524 -7.9095 -4.0311 -0.0005 -0.0005 -0.0002 10.2545 17.9443 28.3291
frequency: -14.0057 16.5154 28.0968 44.9589 68.4223 105.6357 106.9400 120.2023 134.8763 147.0639 151.8758 156.2246 186.0115 207.3804 211.9316 223.7048 261.9619 298.8972 309.3334 346.5399 355.2738 376.9392 421.9335 430.0963 447.7358 477.5726 490.0406 539.5989 598.1504 633.9580 661.9911 672.7767 696.1698 713.7924 728.9228 757.3818 786.1766 788.6596 790.9866 853.4986 875.6600 904.4538 925.8365 946.9520 954.5001 993.3624 996.8617 1008.5464 1049.7554 1054.2878 1068.9742 1082.4205 1097.6910 1105.3251 1137.2168 1137.9077 1177.2402 1206.3552 1211.8690 1248.7022 1272.5590 1281.3840 1288.6900 1294.1619 1314.7920 1328.5091 1347.7665 1360.8982 1365.5745 1375.6539 1377.6826 1388.3953 1399.7047 1405.6499 1457.2359 1459.1609 1466.4838 1473.3434 1476.0074 1477.7847 1479.2955 1481.4095 1488.7144 1489.5422 1614.6880 1651.7411 1675.6676 1682.1514 2961.6699 2963.0665 2968.6937 2973.3924 2974.2455 2981.6588 3003.8371 3018.7101 3027.3185 3035.8516 3050.7626 3066.0689 3071.2297 3073.0132 3082.2336 3095.4348 3105.2114 3118.8068 3514.4691 3516.3345
redmass: 3.6859 3.2695 5.5902 3.3555 1.7249 2.2280 2.4207 2.4596 4.4894 7.2673 1.5823 3.0465 5.4136 1.5608 2.5221 1.1539 3.0703 2.7571 1.9230 3.6089 11.4693 7.9045 2.9906 4.8927 3.7220 9.7346 2.7254 4.6984 5.4416 3.8912 2.3963 2.3553 3.9123 5.3549 1.1091 1.6499 1.3771 1.4369 1.4364 1.5746 2.7419 1.9688 1.3545 2.0033 1.8442 3.3689 3.0148 2.8194 1.5158 1.7055 2.5784 2.4602 2.5238 2.2346 2.7424 2.3103 2.7202 4.1951 1.5030 1.3090 1.2298 2.7153 1.0787 1.2633 1.3719 1.5717 1.5677 1.3571 10.2274 2.0913 1.4513 1.2123 1.2027 1.2343 1.0788 1.0833 1.0693 1.0702 1.0429 1.0481 1.0516 1.0707 1.0890 1.0408 7.0573 8.6644 5.3281 7.2343 1.0628 1.0598 1.0408 1.0568 1.0407 1.0363 1.0978 1.0591 1.0976 1.0974 1.0999 1.1006 1.1006 1.0994 1.0981 1.1043 1.0931 1.0883 1.0756 1.0781
irintensity: 0.0165 0.0424 1.0333 0.2330 0.1741 0.2097 0.0515 0.6619 0.1832 10.4802 0.3562 1.4306 1.0686 0.4792 1.1619 0.0268 1.0447 0.0949 3.0210 3.3445 25.9000 6.2690 1.9917 14.3694 4.9622 12.3669 6.6637 7.6686 1.9132 1.8451 2.1885 21.7096 13.0625 9.3085 5.8928 0.0545 103.7274 29.3541 100.5844 13.8933 8.3380 5.4121 2.8116 8.9798 0.2395 1.6800 2.0155 3.3094 2.9970 15.1186 0.3675 9.3673 12.3267 3.9848 2.9785 2.4157 20.7731 44.4604 10.2306 4.7135 25.5281 272.2732 1.9767 14.5785 2.2249 71.4861 1.0413 5.0534 258.2674 1.7170 1.5088 11.7116 13.7780 15.1227 9.1703 9.4722 0.2719 6.2016 12.8017 11.7924 8.3621 3.1205 24.5707 15.6514 290.3275 47.7956 632.5997 0.8862 18.1363 5.3169 24.4307 50.2613 63.5106 23.8725 3.8774 12.8140 9.7030 15.6786 37.6711 10.0849 85.5179 54.7552 31.6617 16.9865 21.7827 18.6518 83.3136 42.3919
temp: 298.150 k
press: 1.00000 atm
elementType: 8 8 8 7 7 6 6 6 6 6 6 6 6 6 6 6 6 6 1 1 1 1 1 1 1 1 1 1 1 1 1 1 1 1 1 1 1 1
symmnumber: 1
zpe: 827270.3 jmol-1
zpe.correction: 0.315091 hartree
zpe.thermalcorrener: 0.334256 hartree
zpe.thermalcorrenthalpy: 0.335201 hartree
zpe.thermalcorrgfe: 0.266218 hartree
zpe.sumelectzpe: -841.203559 hartree
zpe.sumelectthermal: -841.184393 hartree
zpe.sumelectthermalent: -841.183449 hartree
zpe.sumelectthermalfe: -841.252432 hartree
dipole: 1.6917 0.1713 -0.1970
dipole: 1.7117
quadrupole: -112.2593 -107.4946 -118.2061
quadrupole: -5.2167 -3.1259 3.8132
quadrupole: 0.3940 5.1587 -5.5528 -5.2167 -3.1259 3.8132
hfenergy: -841.5186497 hartree
pointgroup: C01 [X(C13H20N2O3)]
dipole: -0.6671311 -0.0901386 -0.0185576 debye
polarizability: 211.8744715|17.3557452|145.4929378|-13.7677776|0.0093805|138.3116246 unknown
InChI: InChI=1S/C13H20N2O3/c1-4-6-7-8-9(3)13(5-2)10(16)14-12(18)15-11(13)17/h8,14-15H,4-7H2,1-3H3
charge 0 multiplicity 1
38 atoms
O  1.689234 -2.064167 -1.47046
O  0.736927 1.242719 1.98591
O  4.372791 1.675435 -0.867805
N  2.967383 -0.170319 -1.156498
N  2.506794 1.430665 0.518911
C  0.8684 -0.474331 0.22331
C  0.694422 -1.621279 1.271429
C  -0.449848 -0.079924 -0.520082
C  1.854582 -0.981073 -0.855762
C  1.346538 0.782877 0.988284
C  -1.628489 -0.69762 -0.235524
C  -2.98818 -0.430697 -0.844039
C  2.001252 -2.002322 1.999604
C  -0.282523 1.02016 -1.556164
C  -4.011439 0.087688 0.205169
C  3.351647 1.027165 -0.529352
C  -5.428654 0.267189 -0.38506
C  -6.445836 0.792597 0.650621
H  0.298001 -2.501767 0.736487
H  -0.054622 -1.285686 2.009568
H  -1.63883 -1.4789 0.53527
H  -2.932312 0.287241 -1.682437
H  -3.378798 -1.378735 -1.270979
H  1.804638 -2.817106 2.718508
H  2.774008 -2.364579 1.296939
H  2.415991 -1.152625 2.572564
H  0.133057 1.943692 -1.107931
H  0.403953 0.712815 -2.369239
H  -1.240901 1.289665 -2.024768
H  -4.055411 -0.620395 1.058274
H  -3.652699 1.051211 0.618721
H  3.593063 -0.500957 -1.899004
H  2.792603 2.282804 1.013152
H  -5.779263 -0.703157 -0.792683
H  -5.380025 0.966218 -1.244948
H  -7.450798 0.912208 0.205861
H  -6.133031 1.775755 1.049708
H  -6.535526 0.097335 1.506544
