program: Gaussian 09
title: 000048779
version: EM64L-G09RevD.01
frameworkgroup: C1[X(C12H20N2O3S)]
method: RPBEPBE
basis: SDD
operation: Freq
keyword: #p
keyword: freq=noraman
keyword: PBEPBE/SDD
title: #p freq=noraman PBEPBE/SDD
converged: NO YES NO NO
title: Mulliken charges:
elementType: S O O O N N C C C C C C C C C C C C H H H H H H H H H H H H H H H H H H H H
charge: 0.184421 -0.192790 -0.217758 -0.219973 -0.378873 -0.384500 0.103265 -0.546627 -0.392552 -0.332491 0.166082 0.167363 -0.718417 -0.324053 -0.697759 0.146593 -0.634944 -0.668873 0.300196 0.266325 0.212283 0.205889 0.254129 0.220078 0.263498 0.244459 0.243082 0.233635 0.224245 0.209828 0.366605 0.364353 0.211796 0.225310 0.222357 0.212551 0.239119 0.222149
chargesum: 0.00000
title: Mulliken charges with hydrogens summed into heavy atoms:
elementType: S O O O N N C C C C C C C C C C C C
charge: 0.184421 -0.192790 -0.217758 -0.219973 -0.012269 -0.020147 0.103265 -0.246431 0.086056 0.127527 0.166082 0.167363 0.009618 -0.080971 -0.030050 0.146593 0.024519 0.004945
polarizability: 2.27893883e+02 -3.74327726e+00 1.45545858e+02 1.16090962e+00 7.32059398e+00 1.42561690e+02
1716.lowfreq: -7.7356 -0.0005 -0.0005 0.0008 3.5802 12.4211 35.1421 41.8733 54.5942
frequency: 35.0405 41.6494 54.4429 73.2774 84.7348 116.7812 139.6190 145.1383 153.9391 157.0975 177.4640 196.1039 204.7062 210.3819 223.1700 250.9815 261.7241 263.9361 289.3958 301.7027 323.5010 337.9365 358.1195 373.9707 378.3020 421.1734 463.8605 481.0473 494.6315 575.6133 596.0216 619.2087 653.8945 670.5174 686.9798 700.2193 754.4153 761.2858 775.5685 786.1960 809.6350 876.7295 880.4712 921.4217 933.3710 946.4784 949.1959 985.3587 996.2458 1041.1668 1048.7543 1056.0622 1077.4049 1108.1590 1119.8971 1130.9816 1147.3195 1160.8613 1186.1193 1229.2229 1242.1626 1266.3951 1282.8939 1307.7104 1309.9754 1325.7496 1329.8232 1337.3227 1364.4861 1373.7286 1377.2553 1379.3239 1390.2566 1395.5127 1400.5814 1456.3464 1460.5786 1464.4536 1471.0019 1473.4215 1475.0870 1479.2603 1483.6304 1486.5597 1490.2018 1612.1114 1648.9222 1677.0911 2971.1101 2977.6428 2979.7088 2980.7580 2999.5323 3000.0183 3011.8174 3028.9744 3053.0933 3054.6011 3059.9821 3070.1392 3071.9542 3084.9714 3087.1272 3087.8866 3092.9648 3116.4273 3518.4716 3520.3411
redmass: 6.5866 4.7615 2.8418 4.3337 3.0715 2.2402 4.2471 4.0804 4.9801 6.6940 4.4819 3.7427 1.8550 1.1880 1.7368 2.2262 1.3502 1.3290 1.9787 3.2825 2.5424 3.3713 7.4444 3.8046 6.8586 3.1164 3.1318 8.7905 5.0769 4.3538 5.3857 5.4425 2.7483 2.3345 2.6781 6.2485 1.8616 1.7383 1.8974 1.6685 1.5792 2.3475 2.5738 1.1616 3.5918 1.9690 1.5472 2.0458 2.7650 2.7450 1.7219 1.9801 1.7527 2.1739 2.5264 2.3629 2.4079 1.9551 3.7453 1.3489 1.2750 1.3297 1.4994 2.0314 1.3939 1.2834 1.3828 1.3657 8.7293 1.7632 1.6704 1.2200 1.2005 1.2059 1.2052 1.0840 1.0481 1.0469 1.0612 1.0432 1.0464 1.0567 1.0474 1.0584 1.0452 6.8117 8.5993 5.5593 1.0365 1.0364 1.0361 1.0621 1.0385 1.0627 1.0852 1.0855 1.0964 1.0982 1.0972 1.0994 1.0990 1.1004 1.1001 1.0974 1.0996 1.0988 1.0759 1.0780
irintensity: 0.3689 0.1682 0.1339 0.3547 0.3561 0.2623 1.6799 0.7512 1.5532 5.9700 4.6921 1.5391 0.0991 0.2325 0.8793 1.4470 0.6214 0.3233 3.3718 0.7107 0.0953 6.9881 22.5039 3.5916 4.0129 0.6777 2.9052 14.3122 29.5676 13.7419 1.6872 5.6034 3.1002 22.5790 5.7753 2.0505 5.8846 11.3440 26.2565 210.2962 11.2086 3.5568 2.2947 2.5316 13.2845 0.9780 0.6551 0.3924 4.8544 5.4718 30.3240 10.8280 22.0053 2.4986 2.5678 4.2160 6.0202 36.9288 29.3889 15.8171 30.6898 21.8242 124.6361 198.7061 0.8622 17.4804 25.6069 4.9270 220.5837 2.0856 4.0169 21.5394 12.6929 7.4945 27.7428 16.8837 9.9207 2.2601 7.1795 10.0551 12.5710 14.6796 19.7030 16.5641 2.9108 255.7028 87.6290 654.4710 27.8343 33.8262 38.6675 25.7684 27.0811 14.5659 9.7457 0.2616 8.6090 3.3765 31.1946 49.4218 47.1895 20.3199 26.7324 22.7563 32.8954 16.2705 86.1346 50.0586
temp: 298.150 k
press: 1.00000 atm
elementType: 16 8 8 8 7 7 6 6 6 6 6 6 6 6 6 6 6 6 1 1 1 1 1 1 1 1 1 1 1 1 1 1 1 1 1 1 1 1
symmnumber: 1
zpe: 817814.9 jmol-1
zpe.correction: 0.311489 hartree
zpe.thermalcorrener: 0.331808 hartree
zpe.thermalcorrenthalpy: 0.332752 hartree
zpe.thermalcorrgfe: 0.263180 hartree
zpe.sumelectzpe: -1201.151507 hartree
zpe.sumelectthermal: -1201.131188 hartree
zpe.sumelectthermalent: -1201.130244 hartree
zpe.sumelectthermalfe: -1201.199816 hartree
dipole: -1.5854 0.9642 1.1037
dipole: 2.1590
quadrupole: -120.5243 -117.8474 -119.7215
quadrupole: -0.8344 -3.9458 -7.8503
quadrupole: -1.1599 1.5170 -0.3571 -0.8344 -3.9458 -7.8503
hfenergy: -1201.4629965 hartree
pointgroup: C01 [X(C12H20N2O3S1)]
dipole: -0.6319279 0.5676196 -0.003154 debye
polarizability: 227.3444592|-0.6687137|151.2835863|8.0724389|-1.7406191|137.3733849 unknown
InChI: InChI=1S/C12H20N2O3S/c1-5-8(18-7(3)4)12(6-2)9(15)13-11(17)14-10(12)16/h7-8,13-14H,5-6H2,1-4H3
charge 0 multiplicity 1
38 atoms
S  -2.292866 -0.950139 -0.329718
O  0.592962 -2.4097 0.003964
O  0.77431 2.432502 0.155066
O  4.63991 -0.134659 0.19254
N  2.580196 -1.236554 0.063431
N  2.669518 1.120136 0.080944
C  0.438831 0.028485 -0.310431
C  -0.914397 0.102867 0.482178
C  0.268133 0.043751 -1.897491
C  -0.805925 -0.301705 1.975934
C  1.173523 -1.296953 -0.040575
C  1.27078 1.283871 0.023355
C  -0.439361 1.275749 -2.488123
C  -3.820079 0.109702 0.162733
C  0.209477 0.499856 2.825938
C  3.387841 -0.087974 0.109638
C  -3.940519 1.394031 -0.673887
C  -5.046542 -0.809089 0.013722
H  -1.25344 1.151247 0.398799
H  -0.303999 -0.867666 -2.148158
H  1.276711 -0.060665 -2.34653
H  -1.812534 -0.17316 2.418194
H  -0.58585 -1.382969 2.033593
H  -0.465829 1.176975 -3.588903
H  -1.48031 1.339252 -2.132928
H  0.072566 2.220627 -2.240229
H  -3.671858 0.360542 1.229997
H  0.034592 1.588354 2.756235
H  0.121719 0.204091 3.887087
H  1.257359 0.306037 2.527486
H  3.075539 -2.131658 0.135182
H  3.230156 1.972264 0.18597
H  -4.824133 1.977683 -0.348155
H  -3.055655 2.046514 -0.565045
H  -4.06398 1.149949 -1.744406
H  -5.964403 -0.264124 0.304247
H  -4.955733 -1.706354 0.649857
H  -5.167312 -1.140316 -1.034411
