program: Gaussian 09
title: 000048725
version: EM64L-G09RevD.01
frameworkgroup: C1[X(C13H22N2O3S)]
method: RPBEPBE
basis: SDD
operation: Freq
keyword: #p
keyword: freq=noraman
keyword: PBEPBE/SDD
title: #p freq=noraman PBEPBE/SDD
converged: YES YES NO NO
title: Mulliken charges:
elementType: S O O O N N C C C C C C C C C C C C C H H H H H H H H H H H H H H H H H H H H H H
charge: 0.133597 -0.206144 -0.241668 -0.219663 -0.365081 -0.375043 0.118347 -0.014463 -0.770760 -0.397215 -0.739984 0.183309 0.212480 -0.350208 -0.359776 -0.702092 -0.730696 -0.715192 0.154855 0.190868 0.291430 0.289861 0.252015 0.219136 0.274501 0.306720 0.206756 0.191729 0.211079 0.196826 0.224267 0.253372 0.222946 0.369166 0.365627 0.213660 0.242261 0.209331 0.217194 0.205311 0.231338
chargesum: 0.00000
title: Mulliken charges with hydrogens summed into heavy atoms:
elementType: S O O O N N C C C C C C C C C C C C C
charge: 0.133597 -0.206144 -0.241668 -0.219663 0.004085 -0.009415 0.118347 0.176406 -0.189469 0.073936 -0.158763 0.183309 0.212480 0.048278 0.048128 -0.001507 -0.065444 -0.061349 0.154855
polarizability: 1.97460085e+02 -4.74388796e+00 1.84709198e+02 7.26445192e+00 -1.14335947e+00 1.61024050e+02
1716.lowfreq: -10.7326 -7.8950 -4.5360 -0.0009 -0.0005 0.0012 6.2492 23.0398 33.7070
frequency: -2.0151 22.7791 33.5172 48.1170 67.3307 75.3284 82.1904 120.8559 129.7011 139.7461 146.5716 151.2022 162.8460 181.4174 200.5868 216.2291 249.2570 256.3125 258.0694 283.0015 315.6353 324.9928 355.9690 359.5874 386.7122 412.6064 446.7594 454.9514 482.1765 490.3301 584.8816 622.1309 646.6022 657.7196 661.7195 689.6676 708.5579 738.7818 752.8646 757.1162 762.7506 772.9683 787.8645 825.4665 838.5202 853.7430 931.0486 942.6630 971.1234 988.3501 991.1066 1013.8447 1014.6407 1046.9052 1053.4183 1070.0772 1072.8127 1095.1657 1103.1974 1160.4464 1173.3128 1185.7109 1195.2239 1234.4559 1239.5111 1247.1035 1257.7886 1270.5137 1289.2429 1289.6506 1318.6000 1333.0417 1337.3988 1344.0798 1346.0575 1364.1542 1377.0409 1378.9358 1388.1048 1392.2285 1403.9211 1421.9268 1454.6466 1461.8182 1464.2887 1470.2240 1476.0265 1476.7746 1481.3894 1489.0027 1492.7329 1498.7540 1612.2227 1651.0746 1678.3216 2929.1680 2969.3581 2973.0396 2973.8376 2975.7307 2982.3364 2994.2901 3019.0631 3021.7213 3027.6080 3042.6930 3056.0623 3065.0147 3067.4761 3074.2880 3076.7901 3083.9781 3093.6809 3100.7559 3136.4032 3517.8288 3521.1587
redmass: 4.1805 4.9541 6.3978 4.6134 3.5208 2.3195 2.4469 4.5204 5.0789 1.9250 4.8535 2.6046 8.8607 2.6710 2.1305 2.1898 1.5203 1.3929 1.3726 2.8614 2.5770 2.5688 9.1670 10.1584 3.2958 5.7174 2.1394 4.6690 5.2285 4.3504 9.1715 3.7580 2.7311 3.8574 2.8768 4.0283 5.5883 5.1209 1.7121 1.2032 1.6700 1.3611 1.7216 1.8440 1.4804 1.7858 3.4483 1.5281 1.7497 1.8822 3.4039 1.8231 1.7316 1.4385 3.5783 2.5380 1.8274 1.5304 1.6961 2.8712 2.4365 2.1955 1.3031 1.5056 1.4937 1.3210 1.2764 1.1104 1.6553 1.2723 1.6288 1.9594 1.4162 1.5850 1.4255 8.3669 1.6157 1.9774 1.2180 1.2124 1.2021 1.0939 1.0789 1.0766 1.0831 1.0662 1.0547 1.0431 1.0515 1.0498 1.0503 1.0535 6.6850 8.5404 5.5148 1.0817 1.0577 1.0390 1.0369 1.0589 1.0595 1.0370 1.1001 1.0625 1.0959 1.1017 1.0574 1.0991 1.0991 1.1002 1.0998 1.0989 1.1071 1.1004 1.1078 1.0763 1.0776
irintensity: 0.0885 0.2065 1.2616 0.3232 0.9124 0.3442 0.0415 0.3241 0.4101 0.4164 0.6266 1.1329 12.9124 0.9788 0.0382 0.7900 0.7865 0.3054 0.5957 2.9562 1.7442 3.1868 21.1632 22.6164 1.0904 2.0504 0.2057 25.9714 8.0893 6.4422 1.1673 6.1181 0.4058 17.1118 10.1653 9.8478 3.9899 8.4025 7.6057 6.2886 28.2783 9.3211 236.4722 1.2223 3.2697 1.1861 3.5405 8.8598 9.1635 7.1561 1.6961 11.4061 0.8630 7.8877 7.9016 1.1334 1.4007 3.8578 6.0646 30.6197 1.5063 19.2413 1.1984 14.4388 17.9808 0.0922 30.3701 1.3825 73.6429 10.7216 66.6994 148.9856 12.4229 0.3834 3.8616 213.0161 8.9017 3.4639 16.6718 12.3114 22.8505 34.2126 10.3169 0.3158 7.9136 13.8002 11.0676 12.4973 20.7298 12.7227 7.0368 8.5629 282.8399 102.1379 599.4998 19.4829 8.1618 39.8853 32.2061 48.0252 21.1224 21.3350 2.3645 18.5991 50.0083 5.3698 10.9515 37.4541 52.5178 21.9412 100.1132 30.7358 7.5261 22.6865 0.9267 68.3476 57.9481
temp: 298.150 k
press: 1.00000 atm
elementType: 16 8 8 8 7 7 6 6 6 6 6 6 6 6 6 6 6 6 6 1 1 1 1 1 1 1 1 1 1 1 1 1 1 1 1 1 1 1 1 1 1
symmnumber: 1
zpe: 892225.8 jmol-1
zpe.correction: 0.339831 hartree
zpe.thermalcorrener: 0.360706 hartree
zpe.thermalcorrenthalpy: 0.361650 hartree
zpe.thermalcorrgfe: 0.289477 hartree
zpe.sumelectzpe: -1240.378478 hartree
zpe.sumelectthermal: -1240.357602 hartree
zpe.sumelectthermalent: -1240.356658 hartree
zpe.sumelectthermalfe: -1240.428831 hartree
dipole: -0.2669 -1.0644 2.3036
dipole: 2.5516
quadrupole: -116.1927 -128.9508 -130.0917
quadrupole: 7.0190 -3.2081 -4.0702
quadrupole: 8.8857 -3.8724 -5.0133 7.0190 -3.2081 -4.0702
hfenergy: -1240.7183084 hartree
pointgroup: C01 [X(C13H22N2O3S1)]
dipole: 0.0108351 -0.7192439 0.7002644 debye
polarizability: 198.4195026|1.0971926|162.2568069|-5.8290937|7.3988882|182.5170226 unknown
InChI: InChI=1S/C13H22N2O3S/c1-4-9(5-2)7-19-8-13(6-3)10(16)14-12(18)15-11(13)17/h9,14-15H,4-8H2,1-3H3
charge 0 multiplicity 1
41 atoms
S  -1.228829 1.130862 0.533857
O  2.113417 2.29148 0.686147
O  0.17528 -2.137418 0.446278
O  2.765811 -0.446919 -3.012793
N  2.458423 0.882797 -1.114113
N  1.559345 -1.301287 -1.201779
C  1.343757 -0.028088 0.947837
C  -3.704756 -0.075256 -0.246854
C  0.102543 0.47296 1.718809
C  2.486622 -0.505451 1.946271
C  -2.572342 -0.207067 0.794698
C  1.966251 1.152965 0.175266
C  0.947057 -1.218463 0.061284
C  -3.246373 -0.430601 -1.689111
C  -4.399413 1.316021 -0.220734
C  2.080973 -1.608709 2.943286
C  -2.792999 -1.89505 -1.877628
C  -4.955829 1.736698 1.156217
C  2.298987 -0.299381 -1.857085
H  -4.46531 -0.831367 0.056429
H  -0.344446 -0.349903 2.2957
H  0.387442 1.300566 2.386114
H  2.812859 0.399639 2.493129
H  3.353012 -0.8468 1.345068
H  -2.959824 -0.070765 1.818527
H  -2.066968 -1.18391 0.724048
H  -2.427691 0.255091 -1.98607
H  -4.092806 -0.223323 -2.374746
H  -3.684036 2.085235 -0.575904
H  -5.225568 1.294793 -0.959718
H  1.312437 -1.258701 3.654228
H  1.687788 -2.504524 2.433911
H  2.966215 -1.907815 3.533324
H  2.943026 1.647161 -1.596133
H  1.367798 -2.14164 -1.757575
H  -2.541256 -2.093637 -2.936076
H  -1.900932 -2.134465 -1.270955
H  -3.595743 -2.599717 -1.586922
H  -5.526172 2.680268 1.075911
H  -5.635798 0.966145 1.567875
H  -4.143054 1.905476 1.885481
