program: Gaussian 09
title: 000048750
version: EM64L-G09RevD.01
frameworkgroup: C1[X(C13H22N2O3S)]
method: RPBEPBE
basis: SDD
operation: Freq
keyword: #p
keyword: freq=noraman
keyword: PBEPBE/SDD
title: #p freq=noraman PBEPBE/SDD
converged: YES YES NO NO
title: Mulliken charges:
elementType: S O O O N N C C C C C C C C C C C C C H H H H H H H H H H H H H H H H H H H H H H
charge: 0.155165 -0.207274 -0.237343 -0.220425 -0.364429 -0.373424 0.121101 -0.396903 -0.780544 0.182854 0.206486 -0.335048 -0.694216 -0.356212 -0.702464 -0.349293 0.158010 -0.354456 -0.694443 0.218854 0.252023 0.292173 0.291675 0.208699 0.210032 0.294292 0.255348 0.192656 0.188048 0.222678 0.253903 0.223928 0.188515 0.189429 0.369031 0.364790 0.195368 0.194783 0.210367 0.210229 0.216037
chargesum: 0.00000
title: Mulliken charges with hydrogens summed into heavy atoms:
elementType: S O O O N N C C C C C C C C C C C C C
charge: 0.155165 -0.207274 -0.237343 -0.220425 0.004602 -0.008635 0.121101 0.073974 -0.196696 0.182854 0.206486 0.083683 -0.144576 0.024492 -0.001954 0.028651 0.158010 0.035695 -0.057810
polarizability: 2.13853425e+02 -1.98736938e+00 1.80245742e+02 8.86426506e+00 -9.31505302e-01 1.55982263e+02
1716.lowfreq: -8.0747 -4.1138 0.0008 0.0015 0.0021 7.8450 15.1716 27.6709 33.1904
frequency: 14.6487 26.5578 33.1406 37.9116 61.9824 73.7909 79.2890 98.9129 119.6664 121.2993 131.8101 144.3708 147.9836 162.7124 177.7052 188.7317 229.4422 230.0757 251.1628 270.7825 291.2170 319.2088 357.0626 359.8507 407.1167 420.7012 437.2353 459.6408 486.1513 584.5660 623.4033 648.5985 663.3347 689.7454 695.3956 708.1095 725.6259 738.7593 744.7410 755.9159 774.8103 789.2953 791.5287 824.8618 872.8629 889.8216 930.5607 972.2570 984.0278 991.2349 1007.0147 1012.4962 1033.0479 1053.5834 1066.4673 1067.9815 1079.6083 1100.0501 1116.9525 1160.0093 1185.9990 1190.8929 1225.5011 1239.0228 1241.4223 1254.9334 1270.5954 1279.2298 1286.9412 1289.3129 1295.0992 1314.1086 1318.3143 1334.4648 1346.7291 1352.5629 1365.3703 1377.3887 1378.8985 1390.0037 1404.1707 1419.3453 1460.7759 1465.2687 1465.3717 1466.8094 1473.5474 1477.1604 1477.5663 1482.1465 1488.3004 1489.3409 1613.2522 1651.3237 1678.4844 2955.1919 2959.5345 2968.9918 2972.3338 2978.6118 2982.7265 2992.4717 2995.1192 3007.6835 3011.1835 3027.9018 3044.4352 3044.5871 3057.4331 3069.1092 3071.7082 3085.0465 3092.3763 3101.0908 3138.0686 3519.3755 3521.2675
redmass: 5.7664 4.9230 3.5256 2.0106 3.6339 3.9165 2.4708 1.9216 4.1740 3.7760 3.3474 2.1009 5.1676 8.7731 4.1407 2.3801 1.9172 1.5970 1.9174 2.2007 3.0433 3.2311 9.6847 10.0219 4.2355 3.9372 3.4517 4.6703 8.8165 9.1618 3.8936 2.7528 2.8580 4.2022 5.3006 5.6463 1.0670 4.5466 1.1261 1.7267 1.3373 1.5417 1.2406 1.9390 1.2088 1.8929 3.3912 1.1820 2.0253 3.4182 3.4007 1.9104 3.4437 3.7261 2.7393 1.1288 2.2572 1.8865 2.4712 2.8417 2.1620 1.6833 1.3030 1.4039 1.5504 1.2337 1.2655 1.1363 1.0886 1.6643 1.1015 1.4355 1.5681 1.9353 1.4768 1.6382 8.5917 1.6260 1.9515 1.2158 1.2015 1.0957 1.0844 1.0746 1.0707 1.0812 1.0739 1.0431 1.0433 1.0791 1.0901 1.0518 6.7086 8.6190 5.4756 1.0588 1.0589 1.0587 1.0368 1.0591 1.0599 1.0978 1.0370 1.0995 1.0588 1.1034 1.1015 1.1043 1.0573 1.1008 1.0993 1.0987 1.1085 1.1006 1.1076 1.0758 1.0780
irintensity: 0.0548 0.1830 0.6868 0.3180 0.6634 0.1217 0.3784 0.6167 0.5059 0.1312 0.6243 0.4263 0.5866 11.4428 2.1336 0.7767 0.7328 0.5234 1.3209 0.9844 1.6373 3.9946 21.3914 22.6914 1.7857 6.0254 2.8935 22.2881 14.5599 1.0538 5.7181 1.0958 17.3480 5.6520 10.8666 3.0953 12.0381 7.7629 1.5435 5.7170 12.3794 190.4337 45.9626 2.8364 0.1260 3.1273 3.2121 1.4869 8.4869 1.6152 0.9195 9.2990 8.8524 6.9692 1.6319 2.1723 0.3512 7.7553 16.1771 30.0179 18.4783 1.3316 6.7682 17.0276 18.6157 24.3499 3.7550 0.7914 1.3367 77.2375 2.1027 28.0263 56.2120 149.0007 5.0267 0.8856 220.4412 6.9761 3.0587 11.1930 23.7674 34.8861 1.1800 0.1419 2.2930 6.4457 1.4217 12.4893 11.6485 2.8789 23.3809 13.3827 284.0586 97.9101 612.3302 0.3715 5.9599 69.9001 35.0772 52.3167 21.6143 0.2549 21.3387 1.0145 24.8501 7.9677 0.2180 77.6843 10.2940 90.7406 54.7254 30.6705 24.6759 24.9287 0.8257 80.6447 47.9581
temp: 298.150 k
press: 1.00000 atm
elementType: 16 8 8 8 7 7 6 6 6 6 6 6 6 6 6 6 6 6 6 1 1 1 1 1 1 1 1 1 1 1 1 1 1 1 1 1 1 1 1 1 1
symmnumber: 1
zpe: 892909.0 jmol-1
zpe.correction: 0.340091 hartree
zpe.thermalcorrener: 0.362093 hartree
zpe.thermalcorrenthalpy: 0.363038 hartree
zpe.thermalcorrgfe: 0.285901 hartree
zpe.sumelectzpe: -1240.379079 hartree
zpe.sumelectthermal: -1240.357077 hartree
zpe.sumelectthermalent: -1240.356133 hartree
zpe.sumelectthermalfe: -1240.433270 hartree
dipole: 0.1719 -1.6270 2.1790
dipole: 2.7248
quadrupole: -115.7654 -128.5056 -131.4918
quadrupole: 5.1044 -6.5874 -3.1908
quadrupole: 9.4889 -3.2513 -6.2375 5.1044 -6.5874 -3.1908
hfenergy: -1240.7191702 hartree
pointgroup: C01 [X(C13H22N2O3S1)]
dipole: 0.0893358 -1.0106835 0.3460851 debye
polarizability: 213.3712722|-5.6149089|172.7183875|9.0576768|10.947306|163.9917709 unknown
InChI: InChI=1S/C13H22N2O3S/c1-3-5-6-7-8-19-9-13(4-2)10(16)14-12(18)15-11(13)17/h14-15H,3-9H2,1-2H3
charge 0 multiplicity 1
41 atoms
S  0.47938 0.211755 -1.80338
O  -3.008879 0.723795 -2.333862
O  -0.485486 -1.353668 1.240695
O  -2.908944 2.54042 1.943338
N  -2.97526 1.570605 -0.183229
N  -1.792199 0.520436 1.572146
C  -1.958293 -0.688843 -0.618778
C  -3.115843 -1.776415 -0.527677
C  -0.87336 -1.112216 -1.634289
C  -2.657531 0.585807 -1.135269
C  -1.324881 -0.538496 0.772983
C  3.082292 0.317122 -0.72267
C  1.927628 -0.674636 -0.936847
C  4.307186 -0.361915 -0.062673
C  -2.661017 -3.2031 -0.161765
C  5.475419 0.619518 0.1865
C  -2.58601 1.608886 1.166435
C  6.703765 -0.053438 0.840753
C  7.866676 0.930954 1.091606
H  -3.866281 -1.424148 0.20804
H  -3.612381 -1.778106 -1.516617
H  -0.384741 -2.040465 -1.304678
H  -1.325684 -1.247981 -2.628419
H  3.386005 0.757733 -1.693585
H  2.735162 1.154606 -0.085657
H  1.546167 -1.068896 0.02013
H  2.238855 -1.513401 -1.584315
H  4.000263 -0.818675 0.901023
H  4.65964 -1.194529 -0.706424
H  -3.5498 -3.851356 -0.056513
H  -2.100601 -3.229461 0.787913
H  -2.020713 -3.643692 -0.945562
H  5.780581 1.080765 -0.775995
H  5.125804 1.451053 0.83321
H  -3.506174 2.382813 -0.514761
H  -1.43915 0.567158 2.533771
H  6.396485 -0.517142 1.800365
H  7.052741 -0.882946 0.192329
H  7.552988 1.751588 1.764114
H  8.210349 1.387857 0.14422
H  8.732942 0.425454 1.556695
