program: Gaussian 09
title: 000048796
version: EM64L-G09RevD.01
frameworkgroup: C1[X(C14H24N2O3)]
method: RPBEPBE
basis: SDD
operation: Freq
keyword: #p
keyword: freq=noraman
keyword: PBEPBE/SDD
title: #p freq=noraman PBEPBE/SDD
converged: NO YES NO NO
title: Mulliken charges:
elementType: O O O N N C C C C C C C C C C C C C C H H H H H H H H H H H H H H H H H H H H H H H H
charge: -0.216496 -0.207073 -0.221864 -0.378869 -0.372391 0.100029 -0.060688 -0.429828 -0.418436 -0.408854 -0.748368 0.156972 0.138988 -0.370582 -0.732800 -0.356652 0.140458 -0.357551 -0.696050 0.219735 0.206507 0.251758 0.243602 0.220853 0.194867 0.196448 0.241032 0.226769 0.225186 0.190713 0.196557 0.220256 0.238361 0.234127 0.190539 0.187489 0.363419 0.362354 0.197308 0.195428 0.216707 0.210451 0.209588
chargesum: 0.00000
title: Mulliken charges with hydrogens summed into heavy atoms:
elementType: O O O N N C C C C C C C C C C C C C C
charge: -0.216496 -0.207073 -0.221864 -0.015449 -0.010037 0.100029 0.159047 0.028437 0.046019 -0.017538 -0.055381 0.156972 0.138988 0.016688 -0.040055 0.021376 0.140458 0.035185 -0.059304
polarizability: 1.96254876e+02 -7.73555539e+00 1.74259945e+02 9.85213542e+00 8.56238706e-01 1.53018945e+02
1716.lowfreq: -14.7409 -6.5139 0.0001 0.0006 0.0009 5.0949 15.0048 20.7415 33.2925
frequency: 5.6799 20.5178 33.2861 57.6441 72.8723 86.6801 106.2778 118.1554 131.1509 134.8505 148.6101 155.5221 163.7323 183.1336 200.0611 212.8302 223.5687 227.8405 241.0083 303.6244 308.1202 343.5301 363.1594 366.7355 401.6004 411.0837 444.1005 481.1040 490.4629 540.5502 605.5807 625.6371 650.8901 672.8666 695.9118 715.9967 719.8929 735.2184 747.6741 768.2675 778.0604 784.3302 863.7386 881.7799 891.3093 919.5921 933.0559 957.0451 959.3548 992.4738 998.5286 1024.0919 1028.5481 1037.0578 1070.1717 1079.2022 1089.3264 1103.5862 1121.4914 1139.1038 1147.2439 1170.6690 1193.2359 1200.0249 1228.4715 1249.7047 1275.1954 1282.2727 1287.9617 1295.4786 1298.4767 1300.9161 1316.4912 1323.6402 1338.0824 1340.5034 1353.8063 1355.0307 1363.1024 1373.2682 1373.5681 1389.3410 1396.9441 1402.7286 1453.7125 1461.4201 1462.3168 1467.8086 1470.8363 1476.7491 1478.0606 1482.0646 1485.8338 1486.4955 1489.4773 1490.0130 1613.6136 1649.6483 1675.0968 2951.7193 2954.4765 2960.3071 2961.6524 2968.6650 2972.1136 2981.4218 2987.3006 2989.2255 2995.0801 2999.2759 3016.5302 3025.2977 3033.9727 3050.2369 3068.4868 3071.2960 3076.1131 3082.6887 3085.9734 3095.8106 3100.9832 3519.8705 3522.2075
redmass: 1.5980 4.4511 4.6330 4.9581 3.3502 2.4980 1.8439 2.2233 3.2376 2.4911 5.2187 4.9731 4.7595 2.5353 2.4645 1.4258 1.6102 1.1245 3.8195 1.9440 3.0539 4.0845 6.6587 8.7031 2.8036 3.0133 4.1295 3.6849 5.9799 4.1779 5.9524 3.9043 2.3038 2.3400 5.5658 4.2584 1.0664 1.1129 1.8390 1.4207 1.7187 1.2048 1.5291 2.0674 2.2833 2.5597 2.0189 2.1232 1.2578 3.3678 2.9702 1.3631 2.8300 2.0246 2.6565 2.2215 2.6872 2.0397 2.3368 2.9232 2.8187 2.0986 3.9961 1.5790 1.3212 1.3156 1.3284 1.0411 1.2607 1.2057 1.5338 1.7072 1.3498 1.3402 1.4017 1.3813 1.6512 1.4403 7.3987 2.1131 1.4938 1.2163 1.2044 1.1993 1.0800 1.0700 1.0712 1.0653 1.0657 1.0426 1.0714 1.0502 1.0697 1.0606 1.0517 1.0805 6.8659 8.3729 5.6444 1.0587 1.0595 1.0780 1.0620 1.0588 1.0365 1.0624 1.0966 1.0358 1.0382 1.0974 1.1025 1.0606 1.1037 1.1029 1.1007 1.0993 1.1004 1.0983 1.0989 1.0998 1.1028 1.0761 1.0779
irintensity: 0.0057 0.0675 0.0748 0.4582 0.1394 0.1610 0.0228 0.0499 0.4873 1.5650 0.9472 2.0260 7.8614 0.9974 0.7540 0.3191 0.5399 0.0144 0.4739 2.0515 2.6674 7.9447 17.2283 7.6180 2.6001 0.2667 12.7246 6.6336 10.2609 10.4541 5.3657 5.3323 2.5017 39.5123 1.5412 9.0313 11.7349 0.0545 5.0149 6.7001 193.6116 3.4653 1.0247 16.0552 6.0064 9.8282 1.3149 9.6047 1.4459 9.4266 3.7001 0.2057 6.9647 7.8353 2.8001 0.4985 10.9974 12.8193 1.5513 50.4332 13.3446 1.6876 26.8833 0.8460 21.5304 3.0446 29.1200 2.6645 38.5895 42.1838 81.5224 95.4134 15.3571 7.3541 17.4882 3.6223 0.5093 9.8188 204.6183 4.7387 21.0365 10.7599 15.8478 22.0649 14.5184 0.8219 0.4768 5.0296 4.7517 12.6405 1.7324 3.1930 1.3266 12.0953 27.8772 18.6796 284.5857 111.8521 591.5218 1.5621 0.9738 3.8460 16.5602 97.9771 36.8953 60.2312 0.5921 27.4772 14.4784 2.4551 0.5713 15.5069 47.4450 65.3157 91.8960 53.4784 2.1671 31.6309 24.6508 32.1737 21.4494 80.5454 45.5598
temp: 298.150 k
press: 1.00000 atm
elementType: 8 8 8 7 7 6 6 6 6 6 6 6 6 6 6 6 6 6 6 1 1 1 1 1 1 1 1 1 1 1 1 1 1 1 1 1 1 1 1 1 1 1 1
symmnumber: 1
zpe: 962618.7 jmol-1
zpe.correction: 0.366642 hartree
zpe.thermalcorrener: 0.388240 hartree
zpe.thermalcorrenthalpy: 0.389184 hartree
zpe.thermalcorrgfe: 0.313169 hartree
zpe.sumelectzpe: -881.620481 hartree
zpe.sumelectthermal: -881.598884 hartree
zpe.sumelectthermalent: -881.597940 hartree
zpe.sumelectthermalfe: -881.673954 hartree
dipole: 2.0102 -0.5423 -0.7103
dipole: 2.1998
quadrupole: -122.5221 -125.1179 -121.4087
quadrupole: 1.5897 -3.2689 -0.0786
quadrupole: 0.4941 -2.1016 1.6075 1.5897 -3.2689 -0.0786
hfenergy: -881.9871234 hartree
pointgroup: C01 [X(C14H24N2O3)]
dipole: -0.80076 -0.2498321 0.2131137 debye
polarizability: 196.3250243|4.4370734|173.1620147|11.9284768|3.8490542|154.0467269 unknown
InChI: InChI=1S/C14H24N2O3/c1-4-6-7-8-9-10(3)14(5-2)11(17)15-13(19)16-12(14)18/h10,15-16H,4-9H2,1-3H3
charge 0 multiplicity 1
43 atoms
O  0.944788 0.616179 -2.233108
O  3.187423 -1.679367 1.297502
O  3.343662 2.949098 0.986871
N  2.055722 1.756707 -0.560823
N  3.133847 0.628369 1.207537
C  1.49432 -0.655633 -0.183855
C  0.154782 -0.522559 0.722258
C  -1.137338 -0.673981 -0.130385
C  1.501995 -1.959407 -1.025195
C  -2.369184 -0.004004 0.52523
C  0.150352 -1.515184 1.909971
C  1.488326 0.580588 -1.099132
C  2.677687 -0.644931 0.797794
C  -3.668552 -0.242775 -0.277054
C  2.758221 -2.1361 -1.905824
C  -4.907715 0.430918 0.354109
C  2.86719 1.859395 0.583227
C  -6.210892 0.171772 -0.435961
C  -7.446302 0.842335 0.20273
H  0.167237 0.50747 1.139422
H  -1.349239 -1.75176 -0.279325
H  -0.997829 -0.235889 -1.136692
H  0.607078 -1.95334 -1.669552
H  1.420301 -2.814742 -0.331934
H  -2.511076 -0.382282 1.558139
H  -2.188408 1.087809 0.613627
H  0.950766 -1.312795 2.641152
H  0.264274 -2.558627 1.567846
H  -0.814459 -1.438393 2.441658
H  -3.849789 -1.334863 -0.36159
H  -3.534527 0.130895 -1.313471
H  2.687141 -3.078106 -2.478456
H  3.676704 -2.188786 -1.295354
H  2.856763 -1.313125 -2.636199
H  -4.735704 1.525305 0.426633
H  -5.034223 0.066752 1.395454
H  1.937155 2.620013 -1.101014
H  3.823342 0.654559 1.965949
H  -6.085548 0.537665 -1.475513
H  -6.379457 -0.922126 -0.510256
H  -8.36421 0.638965 -0.378903
H  -7.317609 1.939911 0.257921
H  -7.609713 0.47237 1.23267
