program: Gaussian 09
title: 000048723
version: EM64L-G09RevD.01
frameworkgroup: C1[X(C12H20N2O3)]
method: RPBEPBE
basis: SDD
operation: Freq
keyword: #p
keyword: freq=noraman
keyword: PBEPBE/SDD
title: #p freq=noraman PBEPBE/SDD
converged: YES YES NO NO
title: Mulliken charges:
elementType: O O O N N C C C C C C C C C C C C H H H H H H H H H H H H H H H H H H H H
charge: -0.215822 -0.212742 -0.221328 -0.383468 -0.375814 0.103962 -0.516996 0.008900 -0.418194 -0.421989 -0.397913 0.160149 0.150166 -0.705711 -0.715827 -0.725118 0.145986 0.253500 0.212776 0.225039 0.216288 0.252429 0.213063 0.198049 0.190683 0.225758 0.255511 0.236026 0.218981 0.222180 0.214928 0.223954 0.212935 0.217551 0.222564 0.364312 0.365234
chargesum: 0.00000
title: Mulliken charges with hydrogens summed into heavy atoms:
elementType: O O O N N C C C C C C C C C C C C
charge: -0.215822 -0.212742 -0.221328 -0.019156 -0.010580 0.103962 -0.050720 0.233939 0.050522 -0.010877 0.018528 0.160149 0.150166 0.004807 -0.054766 -0.072068 0.145986
polarizability: 1.62908854e+02 -1.75969714e+01 1.49880842e+02 -3.51588584e+00 -2.05000395e-01 1.37016788e+02
1716.lowfreq: -20.0849 -5.6166 0.0006 0.0007 0.0009 9.4450 26.1419 32.2803 66.4887
frequency: 25.5532 31.9926 66.2791 80.5094 90.0121 112.3720 134.3643 141.1476 156.5513 169.0834 189.7140 197.7360 218.5484 228.4213 260.3053 279.7312 281.9975 315.0421 318.4116 356.3916 372.4843 398.8820 466.0169 481.5443 502.3966 531.2589 593.6573 631.5702 656.8365 671.8430 700.6962 735.6908 750.1762 758.4741 768.9028 784.1357 786.6215 803.9457 857.0621 903.5184 922.8454 969.8762 983.2816 993.9030 1008.8672 1021.1347 1029.2135 1054.4161 1059.5219 1088.3340 1125.1424 1140.2320 1152.5476 1162.2548 1194.9515 1243.9461 1256.9577 1268.0084 1287.6640 1294.4939 1314.9503 1318.5685 1329.7355 1337.9457 1355.0662 1364.7419 1367.0406 1374.1113 1375.2230 1387.3511 1391.1723 1402.4897 1449.4488 1463.0672 1469.4872 1470.2407 1475.3130 1478.5692 1484.0864 1488.3074 1489.0914 1496.6047 1612.7327 1647.6907 1676.6925 2962.7231 2963.7034 2975.9037 2979.2560 2979.6146 2983.0639 2995.2401 3002.2950 3021.3401 3025.9438 3044.1607 3068.8040 3069.7143 3073.8005 3075.6805 3077.9562 3084.7551 3103.8030 3518.2571 3519.9448
redmass: 3.5967 6.6297 3.5782 2.9822 2.2742 2.1974 2.4370 4.4874 5.9519 4.6681 2.1035 1.9588 1.9210 1.2022 1.5575 2.3777 3.4145 1.8657 2.4182 9.4725 6.2840 3.7917 3.8596 8.0494 2.8081 2.7238 7.4323 4.3952 2.4798 2.2792 6.3890 1.7131 2.3746 2.1311 1.6714 1.3208 1.6138 1.3477 1.8880 2.0983 3.2029 1.7618 1.9004 3.0491 1.5997 1.7840 1.8800 2.4236 2.9638 1.8934 2.2791 2.6234 2.3790 2.3756 3.0091 1.4237 1.2742 1.1599 1.6868 1.6688 1.3676 1.3449 1.4048 1.5291 1.4643 2.1662 2.6328 1.7027 1.7608 1.2335 1.2083 1.2044 1.0852 1.0597 1.0764 1.0703 1.0452 1.0594 1.0449 1.0459 1.0533 1.0699 6.7751 8.3703 5.5507 1.0632 1.0750 1.0382 1.0575 1.0529 1.0524 1.0372 1.0600 1.0972 1.0979 1.1011 1.1004 1.1000 1.0991 1.0996 1.0995 1.0984 1.1007 1.0757 1.0781
irintensity: 0.2434 0.4272 0.1577 0.2088 0.0404 0.3852 0.3158 1.2124 7.7977 3.7286 0.8144 1.2688 0.1762 0.1216 0.3576 2.4810 1.4847 1.1018 4.2973 22.5515 7.4227 1.2613 11.8763 15.3880 8.7776 14.3855 0.2529 3.9273 3.5225 20.6909 2.7708 1.6875 2.5801 5.1854 8.9795 95.3376 148.1110 1.8718 2.0639 6.8947 4.2543 6.0490 8.4180 3.1220 4.0488 8.9377 7.1601 2.2314 2.5320 6.9927 1.0292 21.8763 6.3917 8.7521 26.2509 15.0582 5.9046 6.5234 112.6798 113.4011 40.1220 26.6890 14.9558 46.2412 4.0948 90.1781 119.9621 10.0104 4.5489 17.1702 13.6678 22.1749 15.4950 4.2482 13.8849 5.5272 11.0776 19.2957 7.6514 1.9034 10.5283 5.6486 279.8219 75.8336 612.4246 67.9681 12.4788 26.9641 19.8289 54.2013 8.7667 21.4943 19.5332 19.2157 27.6846 7.0466 10.0739 38.4906 70.7926 42.9859 50.2031 25.4266 23.6391 85.4046 42.3461
temp: 298.150 k
press: 1.00000 atm
elementType: 8 8 8 7 7 6 6 6 6 6 6 6 6 6 6 6 6 1 1 1 1 1 1 1 1 1 1 1 1 1 1 1 1 1 1 1 1
symmnumber: 1
zpe: 817128.1 jmol-1
zpe.correction: 0.311228 hartree
zpe.thermalcorrener: 0.329793 hartree
zpe.thermalcorrenthalpy: 0.330738 hartree
zpe.thermalcorrgfe: 0.264316 hartree
zpe.sumelectzpe: -803.172534 hartree
zpe.sumelectthermal: -803.153969 hartree
zpe.sumelectthermalent: -803.153024 hartree
zpe.sumelectthermalfe: -803.219446 hartree
dipole: -0.6143 1.2102 0.1526
dipole: 1.3657
quadrupole: -107.3741 -102.9468 -112.8959
quadrupole: 7.2622 0.4874 1.1290
quadrupole: 0.3648 4.7921 -5.1569 7.2622 0.4874 1.1290
hfenergy: -803.4837618 hartree
pointgroup: C01 [X(C12H20N2O3)]
dipole: 0.2630814 0.4680505 -0.0205755 debye
polarizability: 164.3441259|17.238628|148.0540959|-2.7776228|0.8564318|137.4082628 unknown
InChI: InChI=1S/C12H20N2O3/c1-4-8(5-2)7-12(6-3)9(15)13-11(17)14-10(12)16/h8,13-14H,4-7H2,1-3H3
charge 0 multiplicity 1
37 atoms
O  -0.202057 0.592728 2.383021
O  -0.686996 0.323435 -2.44248
O  -3.608881 -1.876874 0.422953
N  -1.926934 -0.551953 1.364477
N  -2.122668 -0.738841 -0.979623
C  -0.407528 0.857875 -0.05912
C  1.144048 0.932087 -0.220159
C  1.890467 -0.381416 -0.589569
C  -1.030253 2.326018 -0.133158
C  3.404644 -0.069597 -0.796542
C  1.642535 -1.532672 0.424068
C  -0.792783 0.287937 1.314652
C  -1.043786 0.126059 -1.252258
C  -0.45221 3.344209 0.86792
C  4.189773 0.313177 0.479824
C  2.370487 -2.847897 0.071024
C  -2.627288 -1.106563 0.280463
H  1.538369 1.32966 0.731846
H  1.355399 1.676514 -1.011107
H  1.508769 -0.718442 -1.576634
H  -2.127827 2.251134 0.004786
H  -0.856444 2.67246 -1.16943
H  3.887748 -0.949297 -1.264014
H  3.491076 0.751719 -1.536914
H  0.554764 -1.74883 0.468399
H  1.926686 -1.205962 1.443664
H  -0.566477 3.009894 1.912587
H  0.619945 3.530626 0.686941
H  -0.983693 4.306564 0.751956
H  3.775104 1.213799 0.967698
H  5.246272 0.526707 0.234343
H  4.180161 -0.504028 1.223899
H  2.129225 -3.173971 -0.958707
H  2.074131 -3.659616 0.760463
H  3.467692 -2.737824 0.139922
H  -2.237792 -0.852909 2.2942
H  -2.593277 -1.161908 -1.786594
