program: Gaussian 09
title: 000048721
version: EM64L-G09RevD.01
frameworkgroup: C1[X(C14H22N2O3)]
method: RPBEPBE
basis: SDD
operation: Freq
keyword: #p
keyword: freq=noraman
keyword: PBEPBE/SDD
title: #p freq=noraman PBEPBE/SDD
converged: YES YES NO NO
title: Mulliken charges:
elementType: O O O N N C C C C C C C C C C C C C C H H H H H H H H H H H H H H H H H H H H H H
charge: -0.215604 -0.212542 -0.221515 -0.383266 -0.375478 0.097808 -0.481387 0.003803 -0.637982 -0.423554 -0.398840 0.183688 0.148893 0.589806 -0.715648 -0.725315 0.142601 -0.823904 -0.737494 0.242063 0.205201 0.228449 0.230907 0.257192 0.214063 0.198204 0.191145 0.226088 0.220498 0.215542 0.224562 0.213053 0.217788 0.222187 0.363945 0.364105 0.228382 0.258236 0.214337 0.220900 0.229085
chargesum: 0.00000
title: Mulliken charges with hydrogens summed into heavy atoms:
elementType: O O O N N C C C C C C C C C C C C C C
charge: -0.215604 -0.212542 -0.221515 -0.019321 -0.011373 0.097808 -0.034124 0.232252 -0.149883 -0.011287 0.018393 0.183688 0.148893 0.589806 -0.055045 -0.072286 0.142601 -0.122950 -0.287509
polarizability: 1.86658350e+02 -9.99773382e+00 1.82384695e+02 -1.24689494e+01 -3.28811583e+00 1.47548350e+02
1716.lowfreq: -16.0300 -7.1293 -0.0005 -0.0005 0.0006 13.5957 24.5248 33.4016 51.8142
frequency: 22.9579 33.3137 51.7829 66.3730 74.1540 100.9812 117.3628 122.6229 136.3793 145.3912 162.7790 190.8188 199.5512 210.0238 218.6794 228.7725 231.4386 269.8859 303.1841 313.0808 325.0414 357.9924 376.9726 398.5190 438.3113 461.6224 481.9961 485.3998 530.2632 543.4927 597.3279 628.4560 649.1128 665.7329 691.1637 727.5429 741.6974 751.1464 764.4781 774.0845 782.4947 809.6165 833.4914 857.8538 888.9513 919.0158 931.8843 951.4683 984.2483 990.0916 993.8811 1003.6066 1014.5932 1020.0395 1029.2819 1052.9752 1059.2745 1098.8499 1123.6851 1148.1827 1157.6905 1189.3438 1219.9985 1253.3176 1261.1430 1273.0926 1293.7980 1300.5066 1318.1123 1321.6669 1332.8546 1339.3686 1359.1342 1365.2719 1368.4940 1374.9520 1375.1319 1391.3231 1393.7637 1395.3193 1431.2861 1448.4063 1457.4963 1463.2522 1471.6272 1472.5738 1478.3725 1484.6991 1486.1322 1487.4587 1496.2923 1615.1274 1649.9034 1660.3251 1675.9128 2961.7556 2968.0812 2976.6730 2977.3321 2980.5045 2982.5320 2984.7544 3010.1423 3023.4250 3027.1303 3046.4485 3061.3594 3069.2334 3072.0487 3075.3929 3078.6178 3085.6391 3089.6858 3090.6429 3193.5229 3518.9816 3521.1437
redmass: 3.4714 6.8316 3.6229 3.5345 3.3734 2.5106 4.0627 2.8348 2.5263 5.5777 9.2736 2.2355 2.8217 2.4126 2.0573 1.2227 1.3608 2.2524 2.7236 2.0317 2.4073 11.6365 8.9060 2.1763 2.3896 3.9560 7.0033 2.5734 2.8700 2.9950 6.5068 4.4062 2.6630 1.6174 2.8886 1.9123 1.9744 1.7214 2.3226 1.6665 1.6690 1.4247 3.9443 2.0015 1.9498 1.8028 3.6416 1.3339 2.1149 1.8080 2.6131 1.4681 1.9408 1.5714 1.7351 1.7063 2.2711 3.0025 2.2764 2.3445 2.0487 3.4052 1.5042 1.4277 1.3221 1.2480 3.0690 1.7284 1.5589 1.3024 1.3508 1.4702 1.6129 3.6046 1.5455 1.8807 1.5751 1.2291 1.2220 1.2100 1.1688 1.0843 1.0988 1.0670 1.0692 1.0661 1.0577 1.0536 1.0500 1.0473 1.0669 6.9097 8.4768 4.7644 5.4955 1.0631 1.0725 1.0380 1.0375 1.0454 1.0575 1.0615 1.0626 1.0969 1.0974 1.1028 1.0976 1.0992 1.0989 1.0999 1.0995 1.0993 1.0913 1.0692 1.1140 1.0760 1.0779
irintensity: 0.1201 0.2881 0.1514 0.1049 0.1239 0.0231 0.3115 0.1736 0.2780 2.0448 11.0677 0.1245 2.5580 0.2416 0.5526 0.2149 0.8856 0.7438 1.4956 0.5858 1.9389 25.0186 7.0148 2.0409 1.8850 15.5340 11.4541 5.2265 20.0900 2.8910 0.4581 5.5132 4.1268 20.4936 10.1805 9.8345 3.2573 1.6699 3.2724 7.1895 206.0212 3.2040 7.6448 1.9938 6.5186 23.5504 17.6640 55.7844 1.4314 3.3946 4.6163 2.5883 1.1376 5.6602 11.1785 9.5132 0.7763 11.4880 2.9993 1.1482 2.8544 39.1540 28.7635 14.6644 15.4448 8.8330 141.0616 31.1101 66.9962 4.4687 28.8528 34.5988 33.7348 147.9609 24.2238 7.2903 5.0175 18.6827 27.6661 9.2997 5.3641 17.9265 6.5361 2.2216 29.1239 10.1573 16.4841 12.0205 14.3230 6.3594 7.3036 285.7582 66.7847 22.4182 612.1765 75.1744 9.4559 26.5418 24.2981 44.9756 9.9871 11.6271 19.1498 16.9857 28.2331 16.8162 12.6085 36.1691 50.7022 70.6738 44.1371 40.6812 5.9045 2.6665 20.0523 82.3066 46.8030
temp: 298.150 k
press: 1.00000 atm
elementType: 8 8 8 7 7 6 6 6 6 6 6 6 6 6 6 6 6 6 6 1 1 1 1 1 1 1 1 1 1 1 1 1 1 1 1 1 1 1 1 1 1
symmnumber: 1
zpe: 902831.1 jmol-1
zpe.correction: 0.343870 hartree
zpe.thermalcorrener: 0.364573 hartree
zpe.thermalcorrenthalpy: 0.365517 hartree
zpe.thermalcorrgfe: 0.294207 hartree
zpe.sumelectzpe: -880.419771 hartree
zpe.sumelectthermal: -880.399068 hartree
zpe.sumelectthermalent: -880.398124 hartree
zpe.sumelectthermalfe: -880.469433 hartree
dipole: -0.5223 1.3560 0.2087
dipole: 1.4680
quadrupole: -115.0628 -119.5527 -124.0559
quadrupole: 5.2516 1.8089 0.5106
quadrupole: 4.4943 0.0044 -4.4987 5.2516 1.8089 0.5106
hfenergy: -880.7636407 hartree
pointgroup: C01 [X(C14H22N2O3)]
dipole: -0.4131653 -0.383976 -0.1242277 debye
polarizability: 191.9574394|4.6951397|175.6469554|13.3384185|-7.4820179|148.987001 unknown
InChI: InChI=1S/C14H22N2O3/c1-5-10(6-2)8-14(7-9(3)4)11(17)15-13(19)16-12(14)18/h10,15-16H,3,5-8H2,1-2,4H3
charge 0 multiplicity 1
41 atoms
O  -0.079759 -0.896854 2.03971
O  0.650352 0.848743 -2.421701
O  3.61073 1.740053 1.049307
N  1.788614 0.338727 1.483391
N  2.104882 1.249913 -0.671601
C  0.255851 -0.421486 -0.352715
C  -1.286764 -0.350829 -0.580576
C  -1.949795 1.057007 -0.528254
C  0.869598 -1.811554 -0.889731
C  -3.463833 0.922224 -0.87731
C  -1.701973 1.80469 0.810647
C  0.598141 -0.337666 1.141496
C  0.975347 0.617417 -1.22864
C  0.66042 -3.063846 -0.046611
C  -4.333205 0.186587 0.169161
C  -2.350147 3.205245 0.877655
C  2.579378 1.145539 0.649119
C  -0.748279 -3.595564 0.144831
C  1.742187 -3.708609 0.469327
H  -1.753316 -1.004789 0.174664
H  -1.493543 -0.783156 -1.57743
H  -1.501854 1.668667 -1.339137
H  1.958149 -1.668255 -1.028559
H  0.427077 -1.944162 -1.89661
H  -3.880559 1.934854 -1.039968
H  -3.549091 0.399751 -1.852058
H  -0.609444 1.932158 0.959604
H  -2.050671 1.185808 1.660253
H  -3.993214 -0.851712 0.336503
H  -5.384829 0.138602 -0.16837
H  -4.321587 0.7031 1.146262
H  -2.050795 3.825738 0.011389
H  -2.042647 3.737522 1.796443
H  -3.453311 3.145491 0.882757
H  2.076584 0.299343 2.46669
H  2.639773 1.871591 -1.287139
H  -0.73131 -4.638784 0.503712
H  -1.289601 -2.991346 0.895984
H  -1.327881 -3.559433 -0.796634
H  2.762105 -3.326293 0.340165
H  1.636221 -4.639829 1.037276
