program: Gaussian 09
title: 000048668
version: EM64L-G09RevD.01
frameworkgroup: C1[X(C15H26N3O2)]
method: RPBEPBE
basis: SDD
operation: Freq
keyword: #p
keyword: freq=noraman
keyword: PBEPBE/SDD
title: #p freq=noraman PBEPBE/SDD
converged: NO YES NO NO
title: Mulliken charges:
elementType: O O N N N C C C C C C C C C C C C C C C H H H H H H H H H H H H H H H H H H H H H H H H H H
charge: -0.359563 -0.266357 -0.112332 -0.028521 -0.133603 -0.452351 -0.298067 -0.290700 -0.277956 0.038957 -0.707276 -0.710858 -0.712287 0.264587 -0.274573 -0.360444 -0.133290 0.280758 -0.612880 -0.600853 0.309772 0.286145 0.258982 0.259051 0.270697 0.264371 0.241221 0.280166 0.264432 0.247803 0.238371 0.261236 0.242803 0.239942 0.232275 0.266598 0.257460 0.274718 0.265924 0.258017 0.241007 0.247279 0.271249 0.239168 0.278298 0.250625
chargesum: 1.00000
title: Mulliken charges with hydrogens summed into heavy atoms:
elementType: O O N N N C C C C C C C C C C C C C C C
charge: -0.359563 -0.266357 -0.112332 -0.028521 -0.133603 0.143566 0.219965 0.244368 0.243431 0.038957 0.043329 0.033123 0.044046 0.264587 0.000146 -0.094521 0.124727 0.280758 0.146655 0.167239
polarizability: 2.10666268e+02 -1.60829354e+01 2.06301152e+02 1.60990726e+01 5.36541736e+00 1.46383302e+02
1716.lowfreq: -13.9098 -7.8680 -1.6773 -0.0007 -0.0004 0.0004 9.3351 27.7705 41.5892
frequency: 5.1261 27.6145 41.4730 60.2143 74.6336 76.9024 82.4623 84.1319 92.9499 100.6661 127.9593 137.3108 161.7938 175.1557 201.9358 219.9057 231.6170 251.6700 262.6746 264.5399 285.2162 303.2410 326.6103 342.0547 354.7637 372.5597 411.1996 430.4213 437.9100 445.7448 481.9928 511.9551 543.0963 592.6538 607.0474 622.6167 659.8717 673.6086 718.7447 753.7037 771.2369 783.3855 791.7653 799.3652 832.5519 833.2654 858.8325 896.5346 907.1658 943.4883 946.6937 956.3540 995.2561 1012.0100 1023.1062 1037.7790 1053.7289 1055.5701 1071.3982 1074.6930 1094.8356 1099.6889 1106.5979 1117.1868 1147.9567 1153.1140 1164.8316 1168.3020 1180.5508 1221.0720 1235.3651 1239.7619 1273.3863 1284.8323 1293.1278 1319.3995 1339.8790 1347.0780 1364.4536 1369.9559 1373.9293 1381.1859 1409.7351 1411.6924 1417.1920 1425.1195 1427.6234 1435.1620 1440.5914 1454.3227 1460.7426 1469.5119 1471.4325 1472.5668 1473.1840 1476.9642 1479.7395 1485.2425 1487.1927 1490.1017 1494.6126 1496.7866 1500.2318 1559.0869 1572.7934 1693.7312 2987.2111 2991.7175 3004.4189 3005.9335 3006.5080 3038.9707 3039.3640 3040.9366 3063.1572 3073.0454 3076.5078 3090.1626 3092.4654 3093.9756 3094.7515 3096.7122 3105.9443 3116.4521 3119.9240 3126.3539 3136.5282 3154.4591 3157.4095 3162.6649 3167.5592 3185.7056
redmass: 3.5358 3.4391 3.3534 3.3214 2.9282 1.2044 1.9965 1.9268 1.6000 1.8090 4.3510 2.5178 3.7149 3.2083 2.4746 1.1179 1.7098 2.0815 2.4450 3.2897 2.5829 2.5418 2.3091 2.5041 3.2392 2.6214 2.6714 3.1067 3.0790 3.3889 3.4835 4.1736 3.0600 6.0867 5.4794 6.0960 3.0780 9.5304 5.8221 2.6889 1.5807 1.9311 1.5033 2.2351 1.7030 1.5720 2.8543 2.9432 2.3534 2.1317 1.8918 2.2397 1.3928 1.8903 2.0733 2.9657 1.5472 2.0865 2.4061 1.9423 1.2233 2.1576 2.0314 1.9967 1.3739 1.6937 1.7075 1.7176 1.9180 2.9689 2.4008 2.2182 1.6265 1.1476 1.1147 2.6859 1.3033 1.3639 3.1458 1.3009 1.3022 1.2880 1.2137 1.2274 1.2040 1.6545 1.2371 2.1066 1.4366 1.0830 1.0767 1.0714 1.0472 1.0589 1.0425 1.0689 1.0456 1.0429 1.0506 1.0499 1.0619 1.1494 1.0643 6.3144 6.6091 8.5789 1.0373 1.0363 1.0375 1.0377 1.0377 1.0605 1.0609 1.0598 1.1019 1.1025 1.0636 1.0999 1.1012 1.0983 1.0985 1.1006 1.1021 1.1033 1.1037 1.1044 1.0993 1.0892 1.0967 1.1007 1.0927 1.1009
irintensity: 0.1866 3.1979 0.3076 1.0287 0.8293 0.4165 0.0173 0.4203 1.9337 1.8070 2.4407 0.5255 5.3339 3.2895 4.5130 0.0364 0.8526 3.0279 1.4250 0.4070 6.0951 3.4859 0.8889 1.9963 17.1771 3.8600 3.6924 6.5729 2.9003 3.1453 0.6571 2.5057 4.6058 3.1772 10.2041 5.7955 3.2797 12.0794 24.1873 37.7955 25.4081 47.8410 8.6665 8.8816 53.2394 5.6657 4.0586 15.2403 2.5128 28.7824 26.5539 34.1800 1.4183 25.8477 25.0186 17.2791 44.8221 0.8594 101.2750 25.1514 1.7680 253.2458 157.4422 8.4581 0.1039 2.0742 11.7116 21.6884 10.7416 66.0461 1.4762 20.2061 17.7308 1.3917 3.1788 3.5141 6.8834 20.2021 105.0289 10.1985 9.8494 0.7309 31.1723 29.7016 52.4830 15.4887 16.6874 37.7494 11.9173 6.5499 23.2276 10.7213 15.4738 27.8976 1.6840 35.1674 36.5684 34.7981 9.1362 11.6793 6.5245 17.1473 4.8754 4.8612 2.5482 435.8512 22.9373 66.6508 4.6030 7.7892 5.8413 9.4765 11.1250 9.7013 23.2761 18.0440 2.6691 5.6360 4.4321 11.4792 4.0847 5.1712 2.2740 25.5170 21.9179 12.9276 1.3636 2.5179 4.0078 4.4258 6.3031 4.4104
temp: 298.150 k
press: 1.00000 atm
elementType: 8 8 7 7 7 6 6 6 6 6 6 6 6 6 6 6 6 6 6 6 1 1 1 1 1 1 1 1 1 1 1 1 1 1 1 1 1 1 1 1 1 1 1 1 1 1
symmnumber: 1
zpe: 1042010.9 jmol-1
zpe.correction: 0.396881 hartree
zpe.thermalcorrener: 0.419859 hartree
zpe.thermalcorrenthalpy: 0.420803 hartree
zpe.thermalcorrgfe: 0.342225 hartree
zpe.sumelectzpe: -900.096693 hartree
zpe.sumelectthermal: -900.073715 hartree
zpe.sumelectthermalent: -900.072771 hartree
zpe.sumelectthermalfe: -900.151349 hartree
dipole: -2.4309 -2.9807 3.2581
dipole: 5.0408
quadrupole: -67.5845 -85.2864 -115.0725
quadrupole: 3.4029 4.8510 3.7097
quadrupole: 21.7300 4.0281 -25.7581 3.4029 4.8510 3.7097
hfenergy: -900.4935741 hartree
pointgroup: C01 [X(C15H26N3O2)]
dipole: 0.9076699 1.3916279 1.0828506 debye
polarizability: 211.9814465|-18.0430222|201.7003393|-14.1425997|-13.9766178|149.6689367 unknown
InChI: InChI=1S/C15H26N3O2/c1-6-18(7-2,8-3)12-13-14(10-9-11-16-13)20-15(19)17(4)5/h9-11H,6-8,12H2,1-5H3
charge 1 multiplicity 1
46 atoms
O  -1.668855 -0.224606 0.693389
O  -2.021432 0.028058 -1.637662
N  1.930207 1.163364 -0.125473
N  1.494271 -2.020742 -0.197722
N  -3.599843 0.816217 -0.076987
C  0.892774 0.2596 -0.851646
C  2.049806 2.485855 -0.925542
C  1.431112 1.414421 1.321121
C  3.329296 0.482629 -0.057652
C  0.549474 -1.028495 -0.134063
C  0.80883 3.387755 -0.918144
C  2.242112 2.429129 2.136306
C  3.953025 0.104468 -1.404668
C  -0.697524 -1.244869 0.511536
C  -0.974875 -2.505268 1.086204
C  1.227381 -3.229434 0.366793
C  0.002319 -3.517727 1.013963
C  -2.447756 0.200706 -0.46774
C  -4.063353 0.943376 1.318954
C  -4.492416 1.368074 -1.12025
H  -0.006325 0.864821 -1.01105
H  1.324245 0.01887 -1.835029
H  2.922447 3.016375 -0.509168
H  2.294416 2.189854 -1.958451
H  0.375983 1.722336 1.234609
H  1.446563 0.427224 1.812569
H  3.974703 1.190964 0.48784
H  3.18915 -0.426725 0.547631
H  1.042865 4.277101 -1.529896
H  -0.075248 2.91295 -1.37522
H  0.541591 3.749383 0.088139
H  1.759398 2.52326 3.12528
H  3.280388 2.107696 2.319755
H  2.255559 3.436603 1.68845
H  4.107865 0.962196 -2.079717
H  3.378008 -0.683142 -1.916869
H  4.950989 -0.319755 -1.193526
H  -1.939355 -2.670629 1.575216
H  2.016152 -3.983996 0.286991
H  -0.177884 -4.507617 1.442501
H  -4.147837 2.010939 1.594457
H  -5.060602 0.478052 1.423829
H  -3.360879 0.449775 2.001483
H  -4.64747 2.449497 -0.953638
H  -4.041073 1.209541 -2.110043
H  -5.4726 0.859216 -1.085657
