program: Gaussian 09
title: 000048655
version: EM64L-G09RevD.01
frameworkgroup: C1[X(C10H16NO2)]
method: RPBEPBE
basis: SDD
operation: Freq
keyword: #p
keyword: freq=noraman
keyword: PBEPBE/SDD
title: #p freq=noraman PBEPBE/SDD
converged: YES YES NO YES
title: Mulliken charges:
elementType: O O N C C C C C C C C C C H H H H H H H H H H H H H H H H
charge: -0.255751 -0.412211 -0.235264 0.635870 -0.555658 -0.555713 -0.591707 -0.529814 -0.506774 0.374771 0.297673 -0.542778 -0.530979 0.280361 0.257001 0.279448 0.280338 0.279517 0.257011 0.278739 0.265443 0.278811 0.286803 0.271005 0.267809 0.382878 0.236104 0.236097 0.270970
chargesum: 1.00000
title: Mulliken charges with hydrogens summed into heavy atoms:
elementType: O O N C C C C C C C C C C
charge: -0.255751 -0.029333 -0.235264 0.635870 0.261152 0.261153 0.231286 -0.243011 -0.235770 0.374771 0.297673 -0.274969 0.212193
polarizability: 1.56365871e+02 -3.35383462e+00 1.31425514e+02 1.90382053e-03 -1.03327974e-04 7.41111854e+01
1716.lowfreq: -9.4864 -0.0009 -0.0008 -0.0007 6.9562 9.5246 35.9749 91.2121 133.0897
frequency: 35.3080 91.1928 133.0882 165.2066 171.3967 182.4085 220.2751 232.6241 246.2310 250.6472 284.4862 322.1201 326.5313 335.3957 387.7401 406.7545 413.3710 420.5041 504.0130 523.0355 550.0550 587.4558 590.4803 619.4095 681.5595 775.1708 831.9568 836.8704 857.3298 865.8240 918.7418 927.5326 951.8054 980.6190 1028.6229 1043.0219 1099.3121 1102.9888 1112.5144 1115.9166 1135.9177 1157.1229 1180.8275 1215.1275 1221.0668 1249.6902 1286.7190 1319.4618 1411.1684 1415.4884 1420.9967 1435.8195 1448.4510 1454.7658 1456.8657 1462.0897 1463.2877 1471.3435 1471.7273 1476.9625 1481.8998 1493.0287 1501.2075 1613.0824 1622.1646 2980.7626 3029.0374 3030.1097 3034.6211 3079.4442 3143.7693 3144.2410 3149.9885 3151.1200 3157.7027 3159.5526 3163.3448 3165.3873 3180.0891 3204.2217 3588.0797
redmass: 3.0791 3.1774 2.8189 3.4744 1.1136 1.5453 3.6108 2.8955 1.0809 2.2791 3.1285 1.1449 3.0622 2.7062 1.1193 3.9368 2.4993 3.0095 5.2493 5.5627 3.2296 4.0073 3.6382 4.0302 1.9855 4.5593 1.4711 1.5242 1.9363 4.5902 2.6892 3.4655 4.4306 6.1858 3.4372 1.1915 1.3727 1.3011 1.2548 1.4761 1.3918 1.3461 1.6082 1.8660 1.8448 1.9217 1.2918 4.8379 5.4518 1.1619 1.1364 1.3171 1.0476 1.2339 1.5673 1.1785 1.0427 1.0492 1.2781 1.1517 1.0459 2.1271 1.1063 6.3743 6.7488 1.0325 1.0322 1.0322 1.0330 1.1055 1.1057 1.1057 1.1007 1.1055 1.1053 1.0920 1.1055 1.1045 1.0926 1.0921 1.0667
irintensity: 0.2978 8.8958 0.0074 4.4924 0.1531 1.3779 2.6554 0.4213 0.5372 3.2188 0.5039 0.3196 9.6049 6.3510 148.4245 6.5536 6.2523 8.6105 0.9009 2.2085 0.3228 6.9983 0.2434 0.1223 31.4887 8.4560 3.9428 6.7684 57.5974 15.1396 29.2932 11.7853 97.7721 1.6190 71.9685 0.0528 20.7712 0.4468 0.0090 17.6390 236.1922 9.1610 71.2264 0.0727 0.8374 3.1286 13.9151 87.9368 5.7896 12.9872 17.2863 3.4993 0.0313 6.5935 45.6217 41.6709 2.9482 19.4720 43.0314 49.0991 35.1819 73.0713 48.1406 128.6539 294.8398 34.5347 2.5958 3.7130 5.5462 29.3796 0.2601 0.2102 7.6266 15.7951 0.9538 1.9367 1.2001 4.6213 0.2548 1.3998 83.3262
temp: 298.150 k
press: 1.00000 atm
elementType: 8 8 7 6 6 6 6 6 6 6 6 6 6 1 1 1 1 1 1 1 1 1 1 1 1 1 1 1 1
symmnumber: 1
zpe: 648120.4 jmol-1
zpe.correction: 0.246856 hartree
zpe.thermalcorrener: 0.260755 hartree
zpe.thermalcorrenthalpy: 0.261699 hartree
zpe.thermalcorrgfe: 0.207272 hartree
zpe.sumelectzpe: -594.581537 hartree
zpe.sumelectthermal: -594.567638 hartree
zpe.sumelectthermalent: -594.566694 hartree
zpe.sumelectthermalfe: -594.621121 hartree
dipole: -4.2774 -1.0324 0.0004
dipole: 4.4002
quadrupole: -18.7408 -66.9104 -74.0458
quadrupole: 8.9215 0.0009 -0.0009
quadrupole: 34.4916 -13.6781 -20.8135 8.9215 0.0009 -0.0009
hfenergy: -594.8283934 hartree
pointgroup: C01 [X(C10H16N1O2)]
dipole: -1.6855266 -0.3949228 -0.0006308 debye
polarizability: 156.320016|-3.5198695|131.4710001|-0.0175632|0.1451695|74.1115536 unknown
InChI: InChI=1S/C10H16NO2/c1-11(2,3)8-5-9(12)7-10(6-8)13-4/h5-7,12H,1-4H3
charge 1 multiplicity 1
29 atoms
O  2.433412 -1.704041 -0.004277
O  1.160232 3.072721 0.008018
N  -2.287088 -0.380134 -0.000224
C  -0.79879 -0.017978 0.000322
C  -2.955763 0.204115 -1.254219
C  -2.954181 0.194803 1.258896
C  -2.528526 -1.889303 -0.005773
C  0.176028 -1.02522 -0.002318
C  -0.467866 1.352679 0.00387
C  1.547027 -0.640542 -0.001464
C  0.90042 1.706954 0.004591
C  1.919945 0.723583 0.001983
C  3.881184 -1.421505 -0.003593
H  -2.459781 -0.216412 -2.141267
H  -4.023456 -0.065152 -1.243634
H  -2.842752 1.296176 -1.25437
H  -2.456944 -0.232166 2.142162
H  -2.841186 1.286842 1.266834
H  -4.021862 -0.074519 1.247826
H  -2.085189 -2.335881 0.895475
H  -3.615705 -2.059136 -0.006219
H  -2.085431 -2.329136 -0.910449
H  -0.03521 -2.094862 -0.005074
H  -1.198722 2.164831 0.005994
H  2.973309 1.021248 0.002645
H  2.127382 3.281851 0.008352
H  4.172682 -0.866019 0.906852
H  4.172598 -0.861178 -0.911095
H  4.359434 -2.410018 -0.006243
