program: Gaussian 09
title: 000048850
version: EM64L-G09RevD.01
frameworkgroup: C1[X(C17H21I3N2O4)]
method: RPBEPBE
basis: SDD
operation: Freq
keyword: #p
keyword: freq=noraman
keyword: PBEPBE/SDD
title: #p freq=noraman PBEPBE/SDD
converged: YES YES NO NO
title: Mulliken charges:
elementType: I I I O O O O N N C C C C C C C C C C C C C C C C C H H H H H H H H H H H H H H H H H H H H H
charge: 0.145881 0.162553 0.180813 -0.200245 -0.361038 -0.179336 -0.205714 -0.518793 -0.508546 -0.365734 -0.371916 -0.365669 -0.351943 -0.545869 -0.356318 0.213262 -0.696057 0.827163 -0.758079 -0.799488 0.824936 0.700748 -0.750047 -0.028872 0.227279 -0.768836 0.187942 0.188198 0.191164 0.195238 0.242017 0.208165 0.186299 0.187725 0.217116 0.246787 0.195501 0.196892 0.209735 0.209023 0.216353 0.319417 0.317015 0.260122 0.217995 0.264304 0.392860
chargesum: 0.00000
title: Mulliken charges with hydrogens summed into heavy atoms:
elementType: I I I O O O O N N C C C C C C C C C C C C C C C C C
charge: 0.145881 0.162553 0.180813 -0.200245 0.031822 -0.179336 -0.205714 -0.199376 -0.191531 0.010406 0.014485 0.084512 0.022081 -0.081966 0.036075 0.213262 -0.060947 0.827163 -0.758079 -0.799488 0.824936 0.700748 -0.750047 -0.028872 0.227279 -0.026416
polarizability: 3.92866871e+02 -7.83852671e+00 3.25137933e+02 2.76147132e+01 1.95662215e+00 1.83400232e+02
1716.lowfreq: -2.6357 -0.0009 -0.0005 0.0002 0.9425 4.3581 10.1024 14.6836 29.5351
frequency: 9.7911 14.5651 29.5151 35.4656 41.9851 45.1182 46.9137 48.4176 53.2663 53.9118 59.2265 70.6319 83.3808 88.6246 91.9967 94.4710 103.8196 110.3384 125.3257 134.5756 141.3073 153.0891 153.6556 163.3758 180.5500 206.0335 222.4669 230.8893 258.6378 274.0913 293.5134 316.7609 326.4183 358.3183 397.4501 413.6521 417.6162 459.3518 482.2933 500.6549 521.6442 536.2652 555.8037 562.6226 589.1606 608.5080 621.1324 627.5953 651.2173 654.8012 720.3555 722.9846 724.8355 731.2798 751.1474 766.4901 800.4077 827.5589 888.5647 901.3346 911.2343 918.5609 939.5103 982.2690 995.3416 999.5630 1020.6072 1029.7459 1036.8633 1043.6428 1061.9359 1063.8872 1080.1726 1082.6040 1102.6810 1119.2454 1169.1034 1191.0913 1218.2163 1225.1681 1234.0667 1250.6571 1267.4803 1276.3195 1285.1776 1296.0807 1297.9269 1306.4280 1319.7960 1338.2990 1348.9095 1358.4502 1360.0945 1362.6323 1366.2446 1385.4538 1388.8608 1439.1827 1440.6344 1443.0786 1454.9790 1463.4593 1463.7997 1467.8132 1469.8479 1476.0517 1476.7422 1484.4578 1489.4735 1532.0249 1535.0974 1643.1417 1646.7983 1646.9855 2950.0359 2952.5975 2960.9825 2961.9475 2969.9787 2972.1020 2985.7554 2989.6092 2994.4563 2996.9140 3013.0340 3017.0722 3036.2263 3062.1371 3068.5173 3071.2035 3085.2598 3118.3387 3501.8700 3514.4023 3515.6850
redmass: 7.0879 9.7148 7.0159 3.9001 3.4989 1.5395 4.0458 9.4394 2.1904 3.7040 5.0277 3.4613 7.9319 2.8617 2.2404 7.1768 15.2907 8.5511 9.5329 2.7935 2.0036 3.4517 5.8197 83.1206 5.8785 10.7430 1.1442 6.3765 5.0926 4.5397 6.9205 6.4015 3.7482 7.3554 4.0729 3.6021 8.5537 3.3583 2.5973 2.1438 2.1186 1.8963 2.4480 2.5643 2.3870 3.6708 3.0750 5.9568 7.5433 4.6545 7.6407 1.1683 3.6351 1.2062 3.3947 1.4388 8.1077 1.3106 1.8973 2.3727 2.7235 3.0218 6.7509 2.2687 1.3388 3.1131 7.5052 3.2908 1.7068 3.5736 2.7660 2.9708 2.0902 2.3597 1.6187 2.6486 2.2429 1.6798 2.5725 1.3233 1.3735 2.4787 1.2761 1.2361 1.0602 1.0877 1.1646 8.1946 1.3960 4.5968 1.5989 1.8073 2.5558 2.8113 4.0033 1.2311 1.2181 1.4943 1.2840 1.4073 1.3912 1.0753 1.0687 1.0731 1.0710 1.0428 1.0732 1.0855 1.0950 9.7375 7.5411 6.9567 9.9352 7.1332 1.0590 1.0589 1.0595 1.0592 1.0580 1.0375 1.0877 1.0770 1.0370 1.0951 1.0971 1.1033 1.1043 1.1025 1.1007 1.0992 1.0988 1.0989 1.0639 1.0765 1.0766
irintensity: 0.0909 0.0414 1.1493 0.5886 1.1985 0.8556 0.9703 1.6959 0.5504 2.3049 2.4463 6.4424 3.1348 0.5356 0.1206 0.7165 1.8093 4.0667 0.1021 0.1218 0.4560 1.4136 4.3786 0.2312 3.5126 1.7042 0.0030 1.3937 1.9115 2.0808 2.1317 3.6789 5.4845 1.8117 2.9347 3.8338 2.5058 5.5085 22.7303 28.1523 94.5274 42.9583 59.3301 21.2889 31.0509 21.3832 58.4563 4.4556 14.8177 42.4083 26.7082 6.1892 14.7974 2.5554 23.5937 9.0520 8.2494 0.3268 3.2019 8.5663 12.5596 5.5578 10.6897 28.3260 6.0403 8.2010 24.8278 27.3854 14.6230 22.0267 137.6648 121.5168 3.0766 2.9952 15.1066 7.8195 107.0301 9.5492 126.7510 27.5064 15.0899 21.1708 9.2239 6.3877 1.0913 0.2664 0.9281 47.5491 4.0005 13.9621 6.4317 13.9089 52.6656 80.2434 270.0616 71.8821 11.6019 181.0024 156.0371 230.6736 102.9162 0.0385 0.3626 19.1849 1.5551 12.2831 1.6340 2.7330 28.5555 7.3664 28.4294 54.2312 289.6306 119.4389 4.6988 5.1693 11.6423 26.2758 111.1523 33.4182 10.8964 26.1655 9.1827 6.2017 11.0208 0.3505 66.2850 45.8608 104.0309 54.3977 13.1640 8.2681 42.3792 20.9629 23.6386
temp: 298.150 k
press: 1.00000 atm
elementType: 53 53 53 8 8 8 8 7 7 6 6 6 6 6 6 6 6 6 6 6 6 6 6 6 6 6 1 1 1 1 1 1 1 1 1 1 1 1 1 1 1 1 1 1 1 1 1
symmnumber: 1
zpe: 927113.0 jmol-1
zpe.correction: 0.353119 hartree
zpe.thermalcorrener: 0.384231 hartree
zpe.thermalcorrenthalpy: 0.385175 hartree
zpe.thermalcorrgfe: 0.281946 hartree
zpe.sumelectzpe: -1103.381029 hartree
zpe.sumelectthermal: -1103.349917 hartree
zpe.sumelectthermalent: -1103.348973 hartree
zpe.sumelectthermalfe: -1103.452202 hartree
dipole: -1.3139 -0.9987 -4.4306
dipole: 4.7280
quadrupole: -180.0021 -176.6648 -209.7293
quadrupole: -12.4440 4.6506 13.9085
quadrupole: 8.7966 12.1340 -20.9306 -12.4440 4.6506 13.9085
hfenergy: -1103.7341481 hartree
pointgroup: C01 [X(C17H21I3N2O4)]
dipole: 0.4712473 0.1864458 1.7897682 debye
polarizability: 390.4996524|19.6822514|311.3775453|29.5089086|-42.2891206|199.5278384 unknown
InChI: InChI=1S/C17H21I3N2O4/c1-3-4-5-6-7-8-10(24)22-16-13(19)11(17(25)26)12(18)15(14(16)20)21-9(2)23/h21-22,25H,3-8H2,1-2H3
charge 0 multiplicity 1
47 atoms
I  -0.756198 -2.371507 2.01717
I  -0.527106 3.285671 -0.410751
I  -5.804521 0.138758 -0.418995
O  1.264697 -1.041388 -0.460067
O  -3.746155 2.550092 -2.265676
O  -4.201591 3.545256 -0.211992
O  -4.09447 -2.683819 -1.471387
N  0.422507 0.544567 1.036879
N  -3.736115 -2.133346 0.774788
C  5.386781 0.147852 0.54924
C  6.510924 0.012065 -0.502508
C  3.974966 0.008597 -0.060419
C  7.929075 0.145665 0.09655
C  2.85774 0.147721 0.996219
C  9.052457 0.0044 -0.955983
C  1.47282 -0.180609 0.433771
C  10.466391 0.140689 -0.350796
C  -0.947518 0.416971 0.674628
C  -1.682932 -0.770726 0.933505
C  -1.627846 1.495169 0.043061
C  -3.044283 -0.912534 0.539154
C  -2.995785 1.409861 -0.300773
C  -3.699029 0.20769 -0.043368
C  -3.710781 2.609155 -0.876108
C  -4.198062 -2.981881 -0.253999
C  -4.857322 -4.263462 0.241606
H  5.52614 -0.62572 1.333881
H  5.481213 1.129778 1.059612
H  6.371683 0.782118 -1.289841
H  6.417862 -0.970381 -1.010297
H  3.866832 -0.974416 -0.555211
H  3.83215 0.771958 -0.850831
H  8.024591 1.129861 0.601886
H  8.069469 -0.623072 0.885339
H  2.871218 1.160722 1.446732
H  3.049092 -0.567447 1.823969
H  8.910742 0.77156 -1.74456
H  8.957173 -0.979181 -1.45965
H  10.645858 -0.636166 0.416423
H  10.596135 1.126562 0.134758
H  11.250265 0.039201 -1.123825
H  0.680507 1.338831 1.628515
H  -3.706444 -2.51314 1.72444
H  -5.955333 -4.152914 0.177784
H  -4.592909 -4.522962 1.281624
H  -4.566571 -5.090758 -0.424901
H  -4.230717 3.344263 -2.623798
