program: Gaussian 09
title: 000048698
version: EM64L-G09RevD.01
frameworkgroup: C1[X(C17H16ClN)]
method: RPBEPBE
basis: SDD
operation: Freq
keyword: #p
keyword: freq=noraman
keyword: PBEPBE/SDD
title: #p freq=noraman PBEPBE/SDD
converged: YES YES NO NO
title: Mulliken charges:
elementType: Cl N C C C C C C C C C C C C C C C C C H H H H H H H H H H H H H H H H
charge: -0.070015 -0.110918 -0.144702 0.078794 -0.670608 0.335251 -0.397547 -0.538654 0.223847 0.390953 0.165959 -0.641760 -0.424802 -0.410394 -0.445731 -0.260813 -0.329608 -0.245452 -0.138729 0.204698 0.249021 0.226834 0.193042 0.215305 0.210343 0.238567 0.189664 0.230045 0.226313 0.236559 0.232357 0.242483 0.228213 0.256070 0.255416
chargesum: 0.00000
title: Mulliken charges with hydrogens summed into heavy atoms:
elementType: Cl N C C C C C C C C C C C C C C C C C
charge: -0.070015 -0.110918 0.059996 0.078794 -0.194754 0.335251 0.010800 -0.089744 0.223847 0.390953 0.165959 0.004262 -0.188243 -0.178036 -0.203248 -0.032601 -0.073538 0.009964 -0.138729
polarizability: 2.82746998e+02 -1.32488371e+01 2.18348527e+02 3.30486538e+00 4.92054108e+00 1.01518043e+02
1716.lowfreq: -7.3804 -2.3882 -0.0016 -0.0001 0.0021 8.4102 46.0422 54.5199 103.4150
frequency: 45.9793 54.3931 103.4022 125.9442 149.5816 168.2510 196.8518 217.8463 230.8223 253.7021 305.9097 313.5660 338.9291 362.3372 372.4170 410.8560 419.6547 438.6870 458.7317 477.3469 487.8147 531.9080 549.2600 581.5063 613.8340 629.9240 650.8358 687.2435 725.7064 744.5589 762.4603 797.1404 810.4845 812.5862 833.5306 872.0624 879.9276 906.1408 942.1031 946.7365 973.1398 977.6063 990.8158 1028.1734 1055.3385 1068.0407 1078.4842 1081.6202 1095.0470 1109.2059 1130.7459 1142.3405 1164.2079 1185.2642 1190.0668 1200.8251 1210.9650 1228.7612 1233.6575 1251.4342 1277.4097 1288.8603 1302.8799 1315.0411 1335.5281 1344.3653 1368.1116 1373.6900 1374.8490 1403.0152 1433.4592 1442.2730 1451.2024 1457.1853 1464.7107 1468.5931 1477.6103 1483.4837 1486.9713 1570.4197 1599.1634 1601.5969 1606.3988 2773.5024 2846.2088 2862.4228 2979.4042 2981.1666 3035.3999 3036.6184 3039.5112 3062.2179 3090.7008 3119.1137 3129.4912 3136.6764 3158.3780 3165.8560 3173.0140
redmass: 5.2534 3.4755 4.0643 5.9788 4.7535 1.7070 1.9146 3.1768 3.2946 2.5924 3.5462 5.8262 3.1589 3.0654 5.0331 5.0157 3.5288 3.3677 4.2306 3.1492 3.1357 4.5778 3.6604 3.2742 4.2021 3.9722 5.9449 4.6719 3.5056 2.3767 3.3525 1.8388 1.4762 4.0938 2.2099 3.7810 1.5018 1.4174 2.7340 1.4443 1.9627 1.4920 2.2919 2.2396 3.0962 2.2511 2.2406 2.0333 2.1707 1.4070 1.9512 1.6579 1.2923 1.3299 1.8108 1.4714 2.3754 2.1167 1.5655 1.3846 1.3932 1.7277 1.8381 1.5782 1.7258 1.8564 2.2217 5.6175 1.9445 3.8386 1.1873 1.2330 1.5863 1.4926 2.6675 1.0753 1.1336 1.1048 2.4382 6.9728 7.3686 6.8325 7.2606 1.0779 1.0684 1.0602 1.0644 1.0605 1.0902 1.0778 1.0933 1.0956 1.0995 1.0871 1.0899 1.0901 1.0986 1.0916 1.0955
irintensity: 0.2984 0.1997 1.5571 0.2195 0.4150 0.6801 0.2598 5.2446 0.5777 0.7434 2.0555 0.4026 0.7241 0.2846 2.3472 1.8058 2.3013 6.4997 6.5790 6.4840 1.4565 1.8344 10.1537 1.7744 12.5150 1.5763 7.9830 18.0607 3.5617 16.0204 0.7227 43.1179 33.1837 11.3747 15.2123 16.2296 15.4598 0.3056 11.9135 3.6479 16.0661 1.5524 6.3135 10.6995 24.8662 0.8850 12.9399 18.8510 14.7495 5.7411 20.8121 4.2215 0.8932 3.5083 1.1825 1.3391 0.6859 6.3876 2.1907 1.9833 1.6505 20.9948 4.5862 4.6773 13.4959 10.5336 4.0172 2.5955 2.0994 11.0806 3.4303 11.0588 46.5585 25.5743 17.1005 6.8511 12.2607 36.0819 12.7433 28.8262 1.9486 16.4484 16.7318 49.5049 50.8959 179.6625 17.0243 28.7903 41.9547 26.8239 56.4663 32.0699 31.8668 5.6716 13.3902 19.7612 24.0257 5.7208 3.3390
temp: 298.150 k
press: 1.00000 atm
elementType: 17 7 6 6 6 6 6 6 6 6 6 6 6 6 6 6 6 6 6 1 1 1 1 1 1 1 1 1 1 1 1 1 1 1 1
symmnumber: 1
zpe: 742421.7 jmol-1
zpe.correction: 0.282773 hartree
zpe.thermalcorrener: 0.298119 hartree
zpe.thermalcorrenthalpy: 0.299063 hartree
zpe.thermalcorrgfe: 0.240433 hartree
zpe.sumelectzpe: -1170.890731 hartree
zpe.sumelectthermal: -1170.875386 hartree
zpe.sumelectthermalent: -1170.874442 hartree
zpe.sumelectthermalfe: -1170.933072 hartree
dipole: -3.1559 -1.2012 0.3147
dipole: 3.3914
quadrupole: -119.8763 -104.7074 -123.3923
quadrupole: -2.4576 -4.5580 -0.0738
quadrupole: -3.8843 11.2846 -7.4003 -2.4576 -4.5580 -0.0738
hfenergy: -1171.1735048 hartree
pointgroup: C01 [X(C17H16Cl1N1)]
dipole: -1.2012245 -0.5739334 0.0892708 debye
polarizability: 284.2031371|-7.9333696|216.5627901|7.7522566|5.4456129|101.8476406 unknown
InChI: InChI=1S/C17H16ClN/c1-19-8-7-11-3-2-4-14-15-10-13(18)6-5-12(15)9-16(19)17(11)14/h2-6,10,16H,7-9H2,1H3
charge 0 multiplicity 1
35 atoms
Cl 5.345322 0.824632 0.685382
N  -2.500648 -1.757605 -0.042645
C  -1.168965 -1.14452 0.206416
C  -1.184394 0.3800 0.029907
C  -0.076964 -1.730475 -0.721244
C  -2.394059 1.115011 -0.027007
C  -3.57691 -1.00714 0.653406
C  -3.72771 0.388982 0.03314
C  0.071298 1.05911 -0.058069
C  1.272705 -1.119087 -0.387366
C  1.329329 0.264995 -0.040707
C  -2.538076 -3.194837 0.304615
C  -2.350134 2.525739 -0.15165
C  0.088035 2.47121 -0.190894
C  2.461334 -1.880838 -0.415554
C  -1.11591 3.202953 -0.231129
C  2.582755 0.845462 0.290169
C  3.714334 -1.304636 -0.104135
C  3.743562 0.057175 0.249814
H  -0.848175 -1.351896 1.267163
H  -0.365321 -1.508025 -1.768824
H  -0.019211 -2.827583 -0.621036
H  -3.371145 -0.915842 1.751457
H  -4.519665 -1.57273 0.541124
H  -4.462089 0.983385 0.609979
H  -4.130586 0.276728 -0.992486
H  -2.252177 -3.396623 1.368359
H  -1.865199 -3.776109 -0.34722
H  -3.561422 -3.576848 0.145581
H  -3.290447 3.089252 -0.19085
H  1.041051 3.000422 -0.294372
H  2.414678 -2.9427 -0.683728
H  -1.090983 4.293194 -0.334179
H  2.651071 1.892652 0.596977
H  4.632817 -1.89761 -0.124994
