program: Gaussian 09
title: 000047454
version: EM64L-G09RevD.01
frameworkgroup: C1[X(C16H17N3O2)]
method: RPBEPBE
basis: SDD
operation: Freq
keyword: #p
keyword: freq=noraman
keyword: PBEPBE/SDD
title: #p freq=noraman PBEPBE/SDD
converged: YES YES NO NO
title: Mulliken charges:
elementType: O O N N N C C C C C C C C C C C C C C C C H H H H H H H H H H H H H H H H H
charge: -0.168392 -0.253559 -0.150257 -0.502395 -0.039160 0.420474 0.493587 -0.328809 -0.350808 0.510579 -0.468927 -0.376848 -0.455445 -0.382970 -0.645202 -0.645739 0.065338 -0.279576 0.044131 0.081451 -0.746554 0.242625 0.244256 0.306850 0.227095 0.262771 0.302846 0.220796 0.238850 0.234963 0.222425 0.236500 0.221361 0.243299 0.259135 0.252407 0.232308 0.230596
chargesum: 0.00000
title: Mulliken charges with hydrogens summed into heavy atoms:
elementType: O O N N N C C C C C C C C C C C C C C C C
charge: -0.168392 -0.253559 -0.150257 -0.195544 -0.039160 0.420474 0.493587 -0.086184 -0.106552 0.510579 -0.241832 -0.114077 -0.152599 -0.162174 0.051036 0.055420 0.065338 -0.020441 0.044131 0.081451 -0.031244
polarizability: 5.40822476e+02 1.44976982e-01 2.48198792e+02 -8.92307361e+00 -6.36985734e+00 1.12151511e+02
1716.lowfreq: -7.2592 0.0004 0.0005 0.0005 3.7760 5.4240 20.1307 27.4704 41.4800
frequency: 19.9092 27.4538 41.4732 48.9450 67.9718 80.6252 89.6082 92.3365 105.0810 113.6331 139.9424 172.1165 203.9286 205.2154 230.5329 235.5121 266.2087 291.1664 318.5383 371.1373 387.8165 398.0880 417.4883 461.5344 467.8004 474.6236 507.6948 518.0152 537.5034 565.4166 578.6473 589.6641 595.7266 618.1658 632.7505 689.4517 716.6156 726.6474 761.4101 784.2902 793.7852 815.1815 828.0030 841.0106 865.9362 872.5722 928.7552 941.1294 944.2349 953.9329 976.7503 987.2410 992.1449 1032.3701 1056.4631 1106.9616 1111.7975 1117.6411 1141.2464 1165.5319 1185.6269 1201.3198 1206.6732 1239.9475 1259.2846 1272.8087 1303.2904 1327.3547 1338.3250 1368.3337 1369.7371 1376.1413 1408.2167 1431.0775 1443.2008 1448.3981 1450.0435 1459.0584 1465.8924 1477.9104 1490.8833 1504.7510 1507.3512 1518.2251 1527.0915 1533.2982 1565.8084 1576.1030 1583.9886 1629.8185 1641.1426 2943.7880 2951.2718 2993.3713 3010.9389 3015.3835 3082.1902 3098.7115 3100.1709 3110.5374 3117.1579 3124.1264 3161.8992 3164.9856 3171.7481 3180.7167 3188.2152 3515.5405
redmass: 4.4463 5.5810 3.4478 5.1226 4.7507 2.5790 1.0627 4.4676 6.1131 2.4756 1.9581 4.7413 1.1942 3.5840 4.1260 2.8106 7.3884 4.0228 3.9384 4.7400 3.6021 3.6494 3.0219 3.7678 3.8528 4.1226 2.8796 3.1931 4.7317 2.5845 1.5590 3.6860 4.1850 5.3645 7.0153 5.5427 3.7799 4.6990 2.1715 4.0471 1.4684 1.8599 2.3852 3.8807 1.8490 6.1407 1.3683 2.8619 2.8726 1.3729 1.3248 1.8234 2.7626 1.7356 1.5005 1.2389 1.3233 2.3091 1.4565 1.7291 1.7625 1.3989 1.6928 2.7384 2.8733 1.6392 2.6172 2.6561 1.7590 1.8480 1.6824 3.7504 2.5996 1.2808 1.1564 1.2289 1.9981 1.2142 1.0421 1.0454 1.1358 1.1940 3.0680 3.0272 2.6623 6.2671 9.4591 7.1708 3.2396 5.5175 6.3391 1.0369 1.0392 1.0358 1.1000 1.1022 1.0970 1.0893 1.0964 1.0944 1.0899 1.1013 1.0875 1.0961 1.0929 1.0944 1.0927 1.0755
irintensity: 0.1041 1.3341 2.1282 4.5390 3.9868 0.4448 0.1085 1.1378 3.0191 6.1581 1.2237 3.6940 0.1535 2.1670 2.6914 0.8267 0.3461 3.3308 2.4186 0.2301 5.7499 0.9242 2.9671 2.8749 2.2079 9.8089 39.1426 27.2364 7.8657 34.8356 25.6510 4.6644 6.0705 74.3645 1.8588 0.9340 1.2961 3.1893 6.6043 4.9906 2.6434 119.3306 24.6598 7.4675 18.0489 32.8035 1.2245 29.1488 21.9830 3.1641 0.1268 24.8528 0.7647 3.1588 24.3097 0.1747 0.9494 20.7858 6.3963 3.6078 61.3048 79.8328 86.6988 151.1727 37.2568 27.1693 156.5328 23.2024 71.9586 118.9346 84.5679 105.5310 31.7003 14.1695 33.7835 12.2263 8.7196 51.8375 1.3918 24.1179 4.7964 195.8521 401.6854 294.8504 210.9554 291.9333 36.4428 113.9861 98.9101 250.9013 176.5100 108.3329 193.6859 4.6743 18.4204 60.0195 13.0169 19.2487 4.0038 47.6165 9.8463 12.7740 7.2692 9.3462 22.0355 5.2818 2.4886 56.1822
temp: 298.150 k
press: 1.00000 atm
elementType: 8 8 7 7 7 6 6 6 6 6 6 6 6 6 6 6 6 6 6 6 6 1 1 1 1 1 1 1 1 1 1 1 1 1 1 1 1 1
symmnumber: 1
zpe: 783944.2 jmol-1
zpe.correction: 0.298589 hartree
zpe.thermalcorrener: 0.319329 hartree
zpe.thermalcorrenthalpy: 0.320273 hartree
zpe.thermalcorrgfe: 0.246706 hartree
zpe.sumelectzpe: -933.051388 hartree
zpe.sumelectthermal: -933.030647 hartree
zpe.sumelectthermalent: -933.029703 hartree
zpe.sumelectthermalfe: -933.103270 hartree
dipole: -11.3108 -3.6669 -2.3927
dipole: 12.1287
quadrupole: -123.2071 -103.9652 -129.6792
quadrupole: -9.8073 -5.9670 -11.0949
quadrupole: -4.2566 14.9853 -10.7287 -9.8073 -5.9670 -11.0949
hfenergy: -933.3499761 hartree
pointgroup: C01 [X(C16H17N3O2)]
dipole: -4.3838225 -1.7446692 -0.7128616 debye
polarizability: 539.8872796|12.8546321|245.855224|-14.4971332|-21.3536383|115.4302747 unknown
InChI: InChI=1S/C16H17N3O2/c1-11(20)17-15-10-13(6-9-16(15)21)18-12-4-7-14(8-5-12)19(2)3/h4-10,18H,1-3H3
charge 0 multiplicity 1
38 atoms
O  5.267874 -0.489128 -0.222926
O  1.779227 2.849036 1.035963
N  -5.226334 0.441144 -0.122209
N  -0.082436 -1.987326 0.125001
N  3.353816 1.553495 -0.148845
C  -3.960986 -0.145686 -0.073472
C  -1.338211 -1.327993 0.055275
C  -3.726482 -1.356428 0.656843
C  -2.842231 0.434573 -0.755075
C  1.21252 -1.480829 0.025575
C  -2.445778 -1.923864 0.718469
C  -1.565167 -0.143069 -0.695166
C  1.558359 -0.127657 -0.001288
C  2.259924 -2.512131 -0.014491
C  -6.351313 -0.174743 0.593594
C  -5.431195 1.68576 -0.876276
C  2.938423 0.289095 -0.09108
C  3.586854 -2.18595 -0.084212
C  4.035456 -0.775712 -0.139132
C  2.591354 2.705883 0.06349
C  2.937536 3.844084 -0.887789
H  -4.543387 -1.850197 1.189251
H  -2.968639 1.345654 -1.345473
H  -0.140844 -2.986654 0.33743
H  -2.29735 -2.839387 1.305512
H  -0.752636 0.315697 -1.263271
H  0.806224 0.651842 0.131474
H  1.950369 -3.566838 0.008059
H  -6.159147 -0.237736 1.683912
H  -6.564932 -1.197898 0.222865
H  -7.256796 0.433599 0.445448
H  -5.213374 1.553861 -1.9555
H  -6.480757 2.003907 -0.780118
H  -4.790179 2.505581 -0.494492
H  4.372014 -2.948547 -0.112723
H  3.926148 4.257264 -0.615834
H  2.180569 4.640105 -0.810731
H  3.014407 3.480896 -1.927858
