program: Gaussian 09
title: 000048625
version: EM64L-G09RevD.01
frameworkgroup: C1[X(C24H31N2O)]
method: RPBEPBE
basis: SDD
operation: Freq
keyword: #p
keyword: freq=noraman
keyword: PBEPBE/SDD
title: #p freq=noraman PBEPBE/SDD
converged: YES YES NO NO
title: Mulliken charges:
elementType: O N N C C C C C C C C C C C C C C C C C C C C C C C C H H H H H H H H H H H H H H H H H H H H H H H H H H H H H H H
charge: -0.271048 -0.092842 -0.270483 -0.356104 -0.251277 -0.567877 0.205520 -0.575634 -0.592696 -0.688567 0.079876 0.216933 0.445146 0.135573 -0.805001 -0.365449 -0.218342 -0.377520 -0.374952 0.140846 -0.205329 -0.212506 -0.381324 -0.385713 0.427591 -0.767005 -0.789672 0.254982 0.255840 0.230527 0.273624 0.300677 0.263335 0.287154 0.257396 0.304290 0.286273 0.247489 0.222377 0.258032 0.219877 0.230216 0.216105 0.263226 0.233615 0.335704 0.245466 0.234191 0.253369 0.249733 0.252888 0.252829 0.238884 0.223642 0.276116 0.237457 0.237719 0.254822
chargesum: 1.00000
title: Mulliken charges with hydrogens summed into heavy atoms:
elementType: O N N C C C C C C C C C C C C C C C C C C C C C C C C
charge: -0.271048 -0.092842 -0.270483 0.154718 -0.020750 0.006424 0.205520 0.232251 0.245356 0.011720 0.079876 0.216933 0.445146 0.135573 -0.095453 -0.131834 0.117362 -0.132054 -0.140761 0.140846 0.048040 0.037226 -0.128436 -0.132884 0.427591 -0.028364 -0.059675
polarizability: 3.17751211e+02 7.87554490e+00 3.00005727e+02 -3.80685174e+01 -3.60336020e+00 2.30569775e+02
1716.lowfreq: -29.1048 -8.6282 -0.0004 -0.0003 0.0002 1.4548 6.2269 13.8831 25.7909
frequency: -28.9651 13.0134 25.7023 33.6492 46.1881 56.9274 64.3665 92.7899 97.8982 107.4869 119.4590 129.5174 154.1046 166.8418 181.6866 194.2220 203.8124 209.4166 223.1140 237.7162 244.1398 266.2672 287.3673 299.9640 310.2802 321.0553 327.0622 332.5885 335.9457 349.8310 389.1723 407.0850 414.7237 417.6606 435.7610 443.8221 471.8759 474.8649 495.2819 507.5243 533.7873 542.8232 575.0952 579.1356 615.0516 637.6042 646.8027 674.8404 687.9595 691.5991 731.8072 747.8635 751.4002 766.0797 771.1183 814.8092 831.2084 843.0168 856.0230 866.6087 871.7218 891.2934 913.7245 931.1862 937.0192 947.0440 966.5639 968.2636 978.4356 983.4959 987.3587 999.5162 1001.0095 1008.1316 1012.3962 1015.8708 1021.8368 1033.1971 1043.6741 1048.6866 1074.3601 1091.9522 1107.3452 1111.8224 1118.4465 1136.6845 1155.6609 1177.7326 1192.5631 1198.0741 1208.8916 1216.2484 1223.6353 1228.5479 1251.0508 1257.9800 1299.9321 1306.1281 1322.5381 1329.7534 1338.2737 1348.1473 1359.2614 1361.0595 1373.6887 1382.3191 1393.3826 1402.5683 1404.6459 1408.4140 1412.1171 1416.7781 1422.8988 1431.6441 1437.4669 1446.8268 1453.5204 1460.2919 1464.9246 1466.4852 1468.3480 1471.5702 1473.2390 1474.8128 1478.6186 1483.9133 1487.2679 1488.6049 1491.0807 1492.9124 1507.9331 1518.7225 1539.1453 1549.5752 1578.9908 1619.7431 1629.3834 2985.5684 2986.8791 2990.4315 2990.8369 3007.9424 3015.8170 3024.0370 3024.6594 3027.3808 3066.3055 3068.7437 3080.9011 3084.0207 3090.5585 3099.4996 3106.2646 3106.7595 3111.7750 3116.3687 3119.7534 3125.5009 3135.1285 3138.2996 3142.0012 3147.0298 3151.7726 3152.0118 3155.3236 3168.3836 3183.9803 3198.8577
redmass: 1.0201 4.9748 4.3783 3.5677 4.7734 3.5067 4.2379 3.0513 1.7747 2.5542 2.5382 3.5984 3.6226 2.2972 3.4377 2.5423 1.1957 1.2040 2.1536 1.5440 2.5887 2.5435 1.4280 1.8857 2.8427 3.1772 3.5474 3.1568 3.1645 2.8731 4.2688 2.8115 2.5125 3.6711 2.2059 3.1982 3.3553 3.6014 4.2368 3.0876 3.2418 3.7768 3.2918 3.9753 3.7579 6.5432 4.5703 5.4750 3.9513 3.8756 3.1342 3.4750 3.5140 3.8487 1.4562 2.4317 2.6473 2.8846 1.2454 1.3376 3.2728 2.3519 2.7817 1.6948 3.4488 1.9695 1.3732 1.3570 1.8044 1.3955 1.8744 1.2945 1.4703 1.7801 2.9091 1.6597 2.1742 1.5600 2.2189 1.6037 2.2717 1.2836 1.8733 1.7757 1.8562 1.2988 1.3636 1.9600 1.5829 1.1310 1.6764 2.6571 4.6053 2.1983 1.6192 1.4615 1.4248 1.2457 1.3094 2.1589 4.3205 1.6544 1.4389 1.2937 1.2564 3.6257 1.3798 1.2073 1.6677 1.3354 2.7603 1.1568 2.3784 1.2610 1.1343 1.1301 1.5806 1.2992 1.0512 1.0762 1.0983 1.1233 1.0599 1.2745 1.5346 1.4683 1.1744 1.0819 1.1134 1.2213 2.5991 3.9238 6.2846 5.0920 5.7607 6.2195 6.3303 1.0396 1.0431 1.0379 1.0383 1.0804 1.0586 1.0350 1.0520 1.0401 1.0935 1.0943 1.0966 1.1004 1.1042 1.1004 1.0996 1.1046 1.0960 1.0893 1.0892 1.0990 1.1041 1.1044 1.0884 1.0952 1.1019 1.0992 1.1046 1.0930 1.0938 1.1006
irintensity: 0.7606 1.1843 0.3908 0.1987 1.4749 1.1566 3.5682 0.1089 0.7073 0.4693 0.7596 1.2435 2.6125 3.2911 1.9601 0.6809 0.5904 1.4634 2.2000 0.6489 2.3995 2.2036 1.0706 0.2811 4.2281 0.1500 0.6353 1.0795 5.0686 0.0325 1.4536 0.0165 0.0616 1.5892 1.0794 7.4778 3.3567 8.1955 5.7387 13.2991 0.3529 5.1250 9.5979 19.1713 0.6232 0.2490 11.0762 3.3709 3.0708 9.5655 11.9733 1.0680 5.4618 9.5008 98.5794 49.7850 53.0215 22.3332 0.0622 0.8113 4.9916 5.7511 12.2608 1.7934 15.2609 35.0107 2.3479 6.7196 5.1473 0.1509 8.8343 2.3982 8.0915 6.7113 1.4207 1.3169 4.3999 4.9224 9.8947 20.5662 18.0402 1.4630 7.4516 3.7721 4.9701 6.8502 9.5579 38.8699 7.7912 12.3567 5.7546 13.8796 35.4179 1.3240 22.6111 17.4956 2.0996 1.5519 1.8042 8.2606 52.1214 65.6310 37.2843 1.2002 39.5297 2.8625 18.5206 22.7211 141.3537 16.3722 6.4145 3.5095 5.8812 100.0452 13.3329 14.5565 60.9061 26.2472 2.5809 33.9276 8.3404 15.7718 14.0801 13.0398 12.4235 7.2898 54.5175 12.7203 14.8146 77.8145 9.0539 23.8550 33.2318 144.3621 0.6389 42.9218 7.9559 9.6183 15.5665 12.1776 23.5246 12.0369 13.0379 2.2646 13.6873 11.3598 10.4978 12.8299 13.6782 13.4676 31.8126 11.1982 9.1589 4.1253 26.6259 7.3166 18.0059 6.0140 2.5927 7.9136 7.9186 15.7403 1.7465 5.3198 2.9423 12.6091 6.0846 19.3508
temp: 298.150 k
press: 1.00000 atm
elementType: 8 7 7 6 6 6 6 6 6 6 6 6 6 6 6 6 6 6 6 6 6 6 6 6 6 6 6 1 1 1 1 1 1 1 1 1 1 1 1 1 1 1 1 1 1 1 1 1 1 1 1 1 1 1 1 1 1 1
symmnumber: 1
zpe: 1300137.2 jmol-1
zpe.correction: 0.495196 hartree
zpe.thermalcorrener: 0.521827 hartree
zpe.thermalcorrenthalpy: 0.522771 hartree
zpe.thermalcorrgfe: 0.437958 hartree
zpe.sumelectzpe: -1115.658070 hartree
zpe.sumelectthermal: -1115.631440 hartree
zpe.sumelectthermalent: -1115.630495 hartree
zpe.sumelectthermalfe: -1115.715308 hartree
dipole: -7.2767 7.0694 0.3841
dipole: 10.1526
quadrupole: -116.1575 -125.6842 -146.9636
quadrupole: 8.9744 4.8016 -6.4625
quadrupole: 13.4443 3.9176 -17.3619 8.9744 4.8016 -6.4625
hfenergy: -1116.1532661 hartree
pointgroup: C01 [X(C24H31N2O1)]
dipole: -2.7935072 2.8549616 0.0163487 debye
polarizability: 319.0990025|6.1626718|299.3589256|-37.250653|-4.9675493|229.8687858 unknown
InChI: InChI=1S/C24H31N2O/c1-17-10-12-21(13-11-17)16-26(5,6)15-18(2)23-19(3)24(20(4)27)25-14-8-7-9-22(23)25/h7-14,18H,15-16H2,1-6H3
charge 1 multiplicity 1
58 atoms
O  4.50379 -2.246037 -1.543408
N  -1.160239 1.928864 -0.359997
N  2.600707 -1.292909 0.383475
C  -0.027411 2.725075 0.358041
C  0.944822 1.956527 1.297148
C  -1.854943 0.947988 0.659022
C  1.756768 0.832351 0.67268
C  -2.168993 2.950263 -0.875235
C  -0.616284 1.151854 -1.554738
C  1.834555 3.025948 2.004372
C  2.717745 0.867966 -0.381315
C  1.702052 -0.51018 1.161012
C  -3.089986 0.253735 0.136066
C  3.238183 -0.455627 -0.57552
C  3.114831 2.098176 -1.166307
C  0.981211 -1.140318 2.215115
C  2.766634 -2.657108 0.623315
C  -2.991114 -1.014457 -0.496658
C  -4.380903 0.815304 0.325068
C  4.226298 -0.997844 -1.520449
C  1.148523 -2.506165 2.458939
C  2.048271 -3.264819 1.645424
C  -4.1452 -1.681955 -0.954902
C  -5.532108 0.143727 -0.133422
C  -5.436976 -1.115666 -0.784678
C  4.949682 -0.067991 -2.488819
C  -6.679249 -1.851968 -1.243629
H  0.522601 3.23608 -0.450557
H  -0.551148 3.493154 0.95606
H  0.333311 1.509285 2.103783
H  -2.080865 1.577288 1.537936
H  -1.0724 0.219951 0.923071
H  -1.640758 3.67784 -1.510979
H  -2.944749 2.432232 -1.455943
H  -2.630619 3.468667 -0.021139
H  0.161895 0.458417 -1.209126
H  -1.445652 0.604857 -2.026115
H  -0.182755 1.868058 -2.270347
H  1.221836 3.74562 2.578906
H  2.517989 2.52187 2.707296
H  2.454073 3.595833 1.291034
H  2.833929 2.023432 -2.234091
H  2.647453 3.007895 -0.759358
H  4.20546 2.263476 -1.13987
H  0.325321 -0.539983 2.853806
H  3.477214 -3.161425 -0.032577
H  -2.010564 -1.493744 -0.611951
H  -4.492185 1.773564 0.84858
H  0.606014 -2.992578 3.274735
H  2.196496 -4.33285 1.821029
H  -4.047333 -2.660617 -1.437981
H  -6.5192 0.592199 0.025584
H  5.59142 0.653897 -1.950687
H  4.25224 0.506704 -3.122844
H  5.588489 -0.689641 -3.134417
H  -7.490193 -1.154704 -1.514631
H  -6.473183 -2.497386 -2.114272
H  -7.066003 -2.504621 -0.437334
