program: Gaussian 09
title: 000048682
version: EM64L-G09RevD.01
frameworkgroup: C1[X(C18H23N4O5S)]
method: RPBEPBE
basis: SDD
operation: Freq
keyword: #p
keyword: freq=noraman
keyword: PBEPBE/SDD
title: #p freq=noraman PBEPBE/SDD
converged: YES YES NO NO
title: Mulliken charges:
elementType: S O O O O O N N N N C C C C C C C C C C C C C C C C C C H H H H H H H H H H H H H H H H H H H H H H H
charge: 1.005497 -0.300265 -0.305544 -0.565701 -0.483399 -0.484964 -0.238371 -0.068029 -0.130261 -0.096688 0.626036 -0.558452 -0.558456 -0.594217 -0.469043 -0.363353 0.235728 -0.298174 -0.036501 0.328488 0.189482 -0.064926 -0.252068 -0.314073 -0.195199 -0.200111 -0.602441 -0.622256 0.272829 0.259044 0.282001 0.272945 0.258938 0.282485 0.283299 0.261234 0.285014 0.340114 0.244671 0.297199 0.277757 0.271542 0.290798 0.297044 0.276099 0.246441 0.245656 0.245387 0.241210 0.290853 0.394701
chargesum: 1.00000
title: Mulliken charges with hydrogens summed into heavy atoms:
elementType: S O O O O O N N N N C C C C C C C C C C C C C C C C C C
charge: 1.005497 -0.300265 -0.305544 -0.171000 -0.483399 -0.484964 -0.238371 -0.068029 -0.130261 -0.096688 0.626036 0.255422 0.255911 0.235330 -0.128929 -0.118682 0.235728 -0.000975 -0.036501 0.328488 0.189482 -0.064926 0.025689 -0.042531 0.095598 0.096933 0.165756 0.155194
polarizability: 5.37899420e+02 1.29972239e+01 2.97051763e+02 2.63638709e+00 -1.00719425e+01 1.53475137e+02
1716.lowfreq: -1.2830 0.0006 0.0013 0.0019 2.9054 4.5831 14.6965 20.5801 25.8389
frequency: 14.4634 20.5667 25.8369 29.1579 31.9520 39.5759 56.9225 62.5888 79.0937 99.3952 100.5091 117.5774 120.1270 127.9720 135.3036 144.8943 168.9108 177.9592 189.6904 196.8761 205.0404 216.0383 240.5875 251.6484 269.8624 272.5316 278.3024 287.6445 312.1429 317.7729 338.2242 352.8979 359.1290 369.8371 374.3129 395.6470 403.8232 413.1485 425.5447 446.8325 449.1608 472.5362 483.7718 527.3541 535.8158 544.2748 564.6045 600.4352 610.7391 617.7858 637.4892 647.5929 664.2907 693.7178 731.8435 754.3317 760.0533 797.1624 812.3032 825.8020 836.1726 848.6594 866.3296 890.1740 899.7662 907.2751 927.0407 933.0447 971.2843 972.9995 978.6279 988.6375 990.6266 998.6256 1042.7033 1045.5148 1057.0029 1060.2708 1076.4649 1096.1817 1098.2467 1104.0326 1106.9035 1110.4649 1126.5909 1149.7567 1154.5288 1182.1919 1203.4303 1214.3681 1220.9740 1229.3505 1237.4420 1251.4501 1262.3485 1286.4292 1352.5902 1365.4688 1390.1305 1394.8653 1402.2657 1417.7416 1421.2629 1422.0050 1428.0235 1440.8896 1452.5146 1453.7186 1456.3019 1461.6356 1462.6413 1471.1870 1475.7261 1475.9235 1481.1947 1487.2497 1489.7890 1496.3001 1502.1007 1575.2596 1579.3680 1589.8511 1598.9041 1691.4577 2987.8853 2993.0645 3030.9769 3031.8119 3036.1567 3066.7750 3074.7008 3138.6531 3144.9150 3145.0502 3147.3410 3151.1005 3151.7632 3159.4147 3159.5699 3161.9423 3164.7857 3167.2751 3173.1904 3178.8577 3180.9815 3185.7901 3479.6394
redmass: 6.5133 5.5942 5.3217 3.2734 4.6715 4.4968 5.3470 4.3579 4.7958 1.9082 1.8095 5.3668 3.0614 1.3222 6.7625 3.2808 1.6355 3.7247 2.1241 2.6784 4.3654 4.5408 1.2597 3.3518 2.9158 3.4245 2.7260 4.1820 7.9300 4.7602 1.0629 5.5037 3.8756 4.9629 4.0155 3.2114 5.6766 3.1001 3.4042 4.8813 3.6014 3.5810 3.9329 4.8160 4.7709 4.6936 5.6098 7.8674 6.1915 6.8370 4.2051 5.9135 11.6927 6.7461 3.8433 3.8702 6.9098 5.4217 4.3462 1.5384 12.2318 1.2479 1.6283 4.5528 5.7882 1.9505 1.7443 2.7707 14.2076 3.6214 1.4745 1.4927 3.3635 1.4100 1.7422 1.1931 1.4775 1.4460 2.5120 1.2195 1.4562 1.3063 1.5274 1.7616 1.7172 1.3748 1.3983 1.7028 2.7597 1.8562 2.1094 3.1353 4.2635 2.1081 1.6468 1.2794 6.5106 3.1442 9.5540 7.3586 3.6672 2.4204 1.3837 1.1357 1.1502 1.1805 1.0491 1.6216 1.4924 1.0532 1.3930 1.0466 1.0476 1.3056 1.1773 1.0450 1.0433 1.1495 1.0650 7.0927 7.1971 7.0236 7.4939 7.9288 1.0366 1.0360 1.0322 1.0324 1.0332 1.1022 1.1025 1.0992 1.1053 1.1047 1.0906 1.0984 1.1054 1.0897 1.1050 1.0895 1.1055 1.1037 1.0953 1.0965 1.0972 1.0926 1.0662
irintensity: 0.6235 0.1877 1.4424 0.1201 4.6996 2.4037 3.8529 0.5707 4.6940 1.5329 1.6031 0.9526 0.7753 0.0837 4.6391 1.1697 3.1612 8.7204 23.2702 9.3925 6.3167 5.2896 0.2540 4.6968 5.9853 6.3878 85.1504 6.1066 6.7105 2.6753 0.3312 1.9805 23.8652 1.6811 12.0342 10.4521 58.0277 5.0632 3.1689 37.9160 2.4873 2.2817 3.4035 30.2243 24.8933 13.9584 150.2863 2.8910 37.3236 22.3552 22.1728 17.6003 15.8814 9.3283 0.4773 11.2876 38.3451 20.3063 14.8396 14.5750 104.8914 1.3518 58.7129 26.8632 26.2387 0.4100 47.8085 9.2146 54.2893 166.1084 16.5490 3.7175 12.0800 0.3661 23.8456 0.0739 87.5419 33.3340 123.3635 0.5288 13.7692 0.9611 179.7046 252.2329 114.5931 0.0744 17.7786 13.1113 225.4454 0.0647 26.2306 34.7828 8.6273 41.5917 8.4042 2.6737 98.1561 151.7365 49.2346 5.4732 54.5905 15.6059 55.3092 19.0119 18.2547 10.5393 0.2055 41.8629 7.2165 4.1453 45.6233 12.0888 8.5258 126.1291 13.1483 34.1714 34.4735 29.5240 86.0378 0.4753 21.2034 11.2490 119.1574 336.8495 16.2409 63.3514 2.6520 3.9702 8.2923 21.3022 17.9231 1.4077 0.2564 1.8478 11.2972 0.3467 28.7065 4.1209 0.4482 3.8295 1.0870 5.9799 7.4476 1.0334 0.2078 50.3771 70.0685
temp: 298.150 k
press: 1.00000 atm
elementType: 16 8 8 8 8 8 7 7 7 7 6 6 6 6 6 6 6 6 6 6 6 6 6 6 6 6 6 6 1 1 1 1 1 1 1 1 1 1 1 1 1 1 1 1 1 1 1 1 1 1 1
symmnumber: 1
zpe: 1034024.1 jmol-1
zpe.correction: 0.393839 hartree
zpe.thermalcorrener: 0.423841 hartree
zpe.thermalcorrenthalpy: 0.424785 hartree
zpe.thermalcorrgfe: 0.329609 hartree
zpe.sumelectzpe: -1690.343521 hartree
zpe.sumelectthermal: -1690.313519 hartree
zpe.sumelectthermalent: -1690.312575 hartree
zpe.sumelectthermalfe: -1690.407751 hartree
dipole: -23.0097 -4.0459 1.4819
dipole: 23.4096
quadrupole: -42.5608 -114.7917 -169.2295
quadrupole: 48.1922 16.3451 0.8446
quadrupole: 66.2999 -5.9310 -60.3689 48.1922 16.3451 0.8446
hfenergy: -1690.7373601 hartree
pointgroup: C01 [X(C18H23N4O5S1)]
dipole: 9.1778741 -0.7069264 -0.3032047 debye
polarizability: 537.7062361|14.7472717|286.4490826|-1.6117557|-39.2339367|164.2710008 unknown
InChI: InChI=1S/C18H23N4O5S/c1-21(2)18(23)27-17-12-14(22(3,4)5)8-11-16(17)20-19-13-6-9-15(10-7-13)28(24,25)26/h6-12,24H,1-5H3
charge 1 multiplicity 1
51 atoms
S  -6.834557 -0.829766 0.636622
O  1.564007 1.699512 -0.543884
O  3.498654 3.052363 -0.90165
O  -7.058861 -0.790153 -1.202045
O  -7.44484 -2.206728 1.221369
O  -7.249484 0.605038 1.254239
N  5.658647 -0.968253 0.609808
N  -0.071007 -0.264811 0.286104
N  1.327689 3.825595 -1.371446
N  -0.788856 -1.348962 0.43628
C  4.140549 -0.794448 0.498243
C  6.101962 -2.154144 -0.259482
C  6.033915 -1.229393 2.07632
C  6.432794 0.266858 0.142805
C  3.613648 0.414048 0.020835
C  3.312135 -1.870709 0.894541
C  2.203611 0.562903 -0.063226
C  1.92065 -1.712731 0.807045
C  1.338513 -0.504888 0.337641
C  2.246914 2.912962 -0.950162
C  -2.201941 -1.133079 0.46672
C  -4.960346 -0.956058 0.54823
C  -2.821903 0.150547 0.485308
C  -2.983376 -2.319385 0.504528
C  -4.222987 0.243505 0.526441
C  -4.390115 -2.23812 0.539585
C  1.807134 5.143748 -1.838531
C  -0.133104 3.602115 -1.409022
H  5.600597 -3.068465 0.084866
H  7.193678 -2.268953 -0.173784
H  5.817247 -1.947775 -1.301561
H  5.537993 -2.145572 2.424229
H  7.126863 -1.34218 2.148622
H  5.694227 -0.375046 2.679898
H  6.203419 0.469826 -0.912868
H  7.506612 0.053641 0.25581
H  6.1593 1.132377 0.762668
H  4.216276 1.265951 -0.292941
H  3.717011 -2.81595 1.269448
H  1.243782 -2.517813 1.107182
H  -2.194304 1.045764 0.473584
H  -2.472039 -3.28643 0.498885
H  -4.737776 1.208852 0.559977
H  -5.02099 -3.131286 0.576402
H  2.903494 5.181243 -1.769985
H  1.374469 5.945352 -1.21317
H  1.500618 5.305962 -2.887614
H  -0.494415 3.673244 -2.451369
H  -0.639743 4.37919 -0.80796
H  -0.376914 2.610562 -1.007533
H  -8.039955 -0.740062 -1.398702
