program: Gaussian 09
title: 000047441
version: EM64L-G09RevD.01
frameworkgroup: C1[X(C18H14O3)]
method: RPBEPBE
basis: SDD
operation: Freq
keyword: #pfreq=noraman
keyword: PBEPBE/SDD
title: #p freq=noraman PBEPBE/SDD
converged: YES YES NO NO
title: Mulliken charges:
elementType: O O O C C C C C C C C C C C C C C C C C C H H H H H H H H H H H H H H
charge: -0.257172 -0.401802 -0.446314 -0.118079 -0.265700 -0.183630 0.219328 -0.308298 0.325233 0.202439 -0.448575 0.481470 -0.492513 -0.605735 -0.704311 0.417138 0.403166 -0.428151 -0.420875 -0.242542 -0.240800 0.227600 0.228799 0.231790 0.211123 0.237609 0.336742 0.245171 0.253002 0.348339 0.247359 0.245607 0.242274 0.230395 0.229913
chargesum: 0.00000
title: Mulliken charges with hydrogens summed into heavy atoms:
elementType: O O O C C C C C C C C C C C C C C C C C C
charge: -0.257172 -0.065060 -0.097975 0.109521 -0.036901 0.048160 0.219328 -0.097175 0.325233 0.202439 -0.210966 0.481470 -0.247342 -0.352732 -0.456952 0.417138 0.403166 -0.182544 -0.178602 -0.012148 -0.010886
polarizability: 3.59194806e+02 -2.45053740e+01 2.07802436e+02 -3.73005842e+00 -1.29034354e+01 1.04385313e+02
1716.lowfreq: -10.4707 -6.6149 -0.0005 0.0006 0.0007 3.9832 34.9286 51.2194 70.8129
frequency: 34.9003 51.2148 70.7936 116.3166 123.6204 148.6101 194.8439 219.9194 240.1349 244.7515 255.7831 267.7721 273.2439 334.1037 351.7444 390.3425 415.3334 420.1405 458.9674 471.9598 482.2429 495.8534 538.1923 550.8797 569.9939 610.6836 623.3538 630.4968 658.7735 689.2419 715.6524 740.8578 755.1259 773.9872 779.9083 810.1712 821.3228 832.7041 843.6578 854.8476 863.7592 896.7960 902.7279 930.7347 933.7807 956.0955 967.8929 976.2258 988.3171 992.0648 1013.9179 1016.6587 1072.3712 1079.8350 1102.1269 1135.9521 1170.1520 1175.2674 1182.1080 1190.9189 1195.7249 1219.1358 1227.1928 1247.2395 1272.7859 1280.3868 1289.0244 1297.5346 1320.8386 1333.9192 1360.3554 1369.2375 1403.0013 1408.6459 1415.0799 1427.4543 1437.6841 1446.2289 1462.2168 1485.9561 1555.1083 1566.9244 1585.9974 1625.9927 1637.7977 2950.3670 2981.4203 3101.5908 3114.4295 3117.1971 3118.1563 3121.2006 3126.2051 3140.8270 3141.5396 3144.2723 3163.0376 3550.4034 3562.5067
redmass: 5.8310 5.3444 4.9027 5.2751 5.8053 5.1960 5.3190 4.5686 1.9793 1.6191 3.5414 1.5603 4.1196 4.5692 5.6995 4.9431 4.2041 4.5994 5.2938 2.4712 4.2810 5.7673 4.2954 5.0709 4.4763 6.6689 6.1829 5.4789 5.1169 5.7510 5.3197 4.8402 1.2786 4.5389 2.8111 2.8989 1.4748 5.1345 3.2039 3.2697 1.8551 4.7792 1.5522 5.7970 2.1271 3.0490 1.3877 1.4444 2.2296 1.3560 2.3362 3.6106 1.6160 1.8124 1.8385 1.6653 1.1707 1.1891 1.3771 1.3302 1.5463 1.3308 1.4765 1.2141 1.2578 2.1214 1.5098 2.5545 1.5682 2.0535 1.6315 1.7448 4.2599 2.4803 1.8583 2.4800 9.1238 4.3969 3.0601 3.1483 5.6136 8.2724 5.6498 6.9900 6.6290 1.0845 1.0844 1.0866 1.0866 1.0936 1.0910 1.0861 1.0888 1.0926 1.0954 1.0951 1.1003 1.0662 1.0665
irintensity: 1.5777 0.4594 1.3268 1.5678 2.6260 1.6723 2.3273 6.6075 98.8331 108.8707 12.8497 103.2363 16.8413 17.2305 2.7023 13.6609 2.7162 0.3581 5.5091 21.7179 6.4842 3.0140 4.7729 4.5294 11.8681 1.4921 6.9910 4.8141 35.5006 2.4588 3.4801 6.9629 67.1219 0.3303 1.9541 5.1870 15.2210 30.9337 1.4602 0.6341 0.3166 2.3942 95.6251 69.8862 0.6118 31.9902 2.4310 13.7816 5.9142 0.2211 8.8058 43.4592 3.6951 12.4850 6.8714 8.2063 15.7531 42.2099 36.0096 13.2719 6.8400 48.3754 2.9461 4.7198 1.6989 2.3791 0.9696 6.1303 6.0311 0.8025 57.4834 3.9720 7.1013 3.5628 6.7634 0.6600 2.0193 2.1934 0.6010 6.4399 7.7401 0.2512 0.1820 4.3451 0.9920 70.4685 45.9927 9.7012 5.3479 42.6215 9.3989 5.3115 0.3979 13.0055 14.5669 36.5172 43.5964 5.8996 10.0582
temp: 298.150 k
press: 1.00000 atm
elementType: 8 8 8 6 6 6 6 6 6 6 6 6 6 6 6 6 6 6 6 6 6 1 1 1 1 1 1 1 1 1 1 1 1 1 1
symmnumber: 1
zpe: 709473.8 jmol-1
zpe.correction: 0.270224 hartree
zpe.thermalcorrener: 0.286683 hartree
zpe.thermalcorrenthalpy: 0.287628 hartree
zpe.thermalcorrgfe: 0.226430 hartree
zpe.sumelectzpe: -918.486454 hartree
zpe.sumelectthermal: -918.469995 hartree
zpe.sumelectthermalent: -918.469051 hartree
zpe.sumelectthermalfe: -918.530248 hartree
dipole: 0.7950 3.1105 1.9280
dipole: 3.7449
quadrupole: -101.0537 -109.7996 -129.1371
quadrupole: -8.0414 -0.6086 -9.3136
quadrupole: 12.2764 3.5306 -15.8070 -8.0414 -0.6086 -9.3136
hfenergy: -918.7566787 hartree
pointgroup: C01 [X(C18H14O3)]
dipole: 0.3036825 -1.2274824 -0.7561984 debye
polarizability: 359.2084439|24.4586131|207.7014936|0.2195641|-13.7698388|104.4726174 unknown
InChI: InChI=1S/C18H14O3/c19-15-12-6-5-11-7-9-3-1-2-4-10(9)8-13(11)14(12)17-18(21-17)16(15)20/h1-8,15-20H
charge 0 multiplicity 1
35 atoms
O  -2.138118 2.253944 0.750238
O  -4.303269 0.746864 1.687666
O  -3.982831 -0.862198 -1.614689
C  -3.176337 1.755513 -0.217912
C  -1.736221 1.456964 -0.497314
C  -4.113753 0.634024 0.238269
C  -1.19448 0.096829 -0.217988
C  -3.584045 -0.757628 -0.181924
C  -2.088988 -0.962566 -0.018398
C  0.233907 -0.121437 -0.114604
C  -1.595363 -2.280868 0.271296
C  0.722796 -1.472396 0.154007
C  -0.231279 -2.533157 0.345111
C  1.179371 0.925961 -0.252207
C  2.116636 -1.707563 0.243282
C  2.573518 0.691544 -0.15987
C  3.05862 -0.662948 0.086645
C  3.535622 1.755773 -0.30004
C  4.47958 -0.888227 0.174423
C  4.900231 1.50107 -0.209136
C  5.377735 0.164121 0.029634
H  -3.653028 2.569832 -0.776172
H  -1.219327 2.069647 -1.245874
H  -5.076906 0.758653 -0.298988
H  -4.124394 -1.53958 0.39463
H  -2.316281 -3.09149 0.435644
H  -5.057298 0.158329 1.949316
H  0.13822 -3.542061 0.561991
H  0.83415 1.953322 -0.410667
H  -3.426919 -1.557999 -2.049097
H  2.472471 -2.72576 0.445648
H  3.171628 2.774469 -0.478999
H  4.841579 -1.906592 0.35987
H  5.62208 2.317888 -0.317366
H  6.455991 -0.016878 0.098476
