program: Gaussian 09
title: 000048589
version: EM64L-G09RevD.01
frameworkgroup: C1[X(C12H16N2O3)]
method: RPBEPBE
basis: SDD
operation: Freq
keyword: #p
keyword: freq=noraman
keyword: PBEPBE/SDD
title: #p freq=noraman PBEPBE/SDD
converged: YES YES NO NO
title: Mulliken charges:
elementType: O O O N N C C C C C C C C C C C C H H H H H H H H H H H H H H H H
charge: -0.217474 -0.233371 -0.219535 -0.371987 -0.378200 0.078479 -0.609780 -0.586216 0.168915 0.186261 0.568337 0.520426 0.152777 -0.834399 -0.839272 -0.724349 -0.726052 0.272515 0.223539 0.242261 0.258956 0.367148 0.364157 0.229728 0.267998 0.216838 0.220167 0.265800 0.226977 0.224255 0.227712 0.237599 0.219792
chargesum: 0.00000
title: Mulliken charges with hydrogens summed into heavy atoms:
elementType: O O O N N C C C C C C C C C C C C
charge: -0.217474 -0.233371 -0.219535 -0.004839 -0.014043 0.078479 -0.113727 -0.084999 0.168915 0.186261 0.568337 0.520426 0.152777 -0.119836 -0.126329 -0.272382 -0.268661
polarizability: 1.77745550e+02 -1.46337299e+01 1.38320771e+02 3.45826481e+00 1.11062002e+01 1.33838056e+02
1716.lowfreq: -3.0335 -0.0008 -0.0007 -0.0005 9.1838 11.4533 23.6449 33.0808 42.8823
frequency: 22.3229 33.0506 42.6540 86.0457 110.6041 126.6664 142.3483 150.4783 162.4693 181.6562 196.3299 201.4581 205.7494 245.6706 306.2428 355.6349 359.8806 382.2069 386.1744 411.5221 435.6641 449.2936 483.7687 520.0495 545.7839 592.6797 628.0169 649.9922 664.3599 687.7426 696.1524 739.9864 757.9339 774.5793 789.6605 812.2198 836.8499 863.3254 904.6545 944.0751 949.2615 949.9964 975.1381 987.9914 994.8858 997.9348 1015.2863 1047.5572 1055.8381 1072.9447 1085.4620 1186.6503 1208.8455 1255.1421 1277.2253 1297.5597 1308.7650 1322.7187 1335.8537 1366.7551 1376.8031 1378.1372 1395.5286 1396.9459 1427.4644 1428.6076 1458.3371 1459.0164 1462.2897 1474.5076 1483.0780 1484.9661 1611.9909 1646.1737 1659.6789 1662.8143 1679.2401 2968.0094 2973.4009 2980.8623 3017.6587 3048.5122 3055.5023 3059.8332 3085.8504 3091.0652 3091.7146 3092.7783 3093.4924 3194.5437 3196.6313 3517.4342 3520.0191
redmass: 4.9950 4.0494 3.3239 3.2744 3.4015 4.3168 3.2838 5.7716 3.9046 1.6152 2.9608 1.7142 1.7871 4.2239 4.3073 6.6320 3.7398 4.5048 1.9991 2.8432 2.2410 2.6300 8.7905 3.5627 2.9500 5.7056 4.4864 2.6695 1.7032 1.7898 2.0886 1.8039 1.7408 2.4596 1.6960 2.9496 3.3347 2.5342 1.8741 2.1159 1.6039 1.3787 1.6547 2.1110 3.3964 1.6270 1.5306 1.5959 1.5310 1.9221 2.8841 3.1376 1.3711 2.0075 1.5969 2.8502 2.2463 1.6096 1.7832 8.1365 1.5909 1.9799 1.2167 1.2232 1.1894 1.1919 1.0513 1.0681 1.0907 1.0768 1.0627 1.0670 6.6633 7.8660 4.7592 4.9177 5.4956 1.0388 1.0407 1.0602 1.0601 1.0932 1.1001 1.0940 1.1019 1.0957 1.0765 1.0883 1.0638 1.1143 1.1142 1.0761 1.0777
irintensity: 0.6199 0.2529 0.0715 0.4036 0.1312 0.1732 0.9098 1.1554 12.7595 1.1914 0.5851 1.3927 1.3138 2.3874 2.0901 20.7581 9.8394 6.2330 0.5251 2.8319 5.1550 10.1780 14.2085 35.5666 5.6561 0.2148 3.8151 5.4548 16.4355 12.8041 2.7823 15.2296 3.1561 3.4340 195.3072 14.2117 0.6572 5.4167 3.6603 59.5606 29.1189 59.5356 3.1871 7.9475 2.5278 3.8489 5.1259 2.2651 9.6611 7.5734 12.4209 24.8932 25.0195 34.0927 33.8197 174.4209 18.9739 38.5182 128.5915 220.1620 9.0915 5.0284 20.7847 23.5102 3.2353 2.9794 8.4873 9.0671 24.5867 28.8124 11.6183 19.7202 264.0079 99.9423 8.1164 15.3877 624.0401 22.9333 20.7588 25.7368 6.5302 13.7113 5.8129 15.8950 8.6721 16.1625 20.4550 4.9664 4.7060 20.9978 15.9366 76.4363 54.6976
temp: 298.150 k
press: 1.00000 atm
elementType: 8 8 8 7 7 6 6 6 6 6 6 6 6 6 6 6 6 1 1 1 1 1 1 1 1 1 1 1 1 1 1 1 1
symmnumber: 1
zpe: 694137.0 jmol-1
zpe.correction: 0.264383 hartree
zpe.thermalcorrener: 0.281976 hartree
zpe.thermalcorrenthalpy: 0.282920 hartree
zpe.thermalcorrgfe: 0.218247 hartree
zpe.sumelectzpe: -800.782162 hartree
zpe.sumelectthermal: -800.764569 hartree
zpe.sumelectthermalent: -800.763625 hartree
zpe.sumelectthermalfe: -800.828297 hartree
dipole: -1.4584 -0.4932 -0.1943
dipole: 1.5517
quadrupole: -104.7102 -102.4309 -107.9497
quadrupole: 5.3665 0.0202 -2.7477
quadrupole: 0.3201 2.5993 -2.9194 5.3665 0.0202 -2.7477
hfenergy: -801.0465444 hartree
pointgroup: C01 [X(C12H16N2O3)]
dipole: -0.5382122 0.285526 0.0388141 debye
polarizability: 181.1632792|7.8752761|138.0636945|-3.0997023|10.8648674|130.6774042 unknown
InChI: InChI=1S/C12H16N2O3/c1-7(2)5-12(6-8(3)4)9(15)13-11(17)14-10(12)16/h13-14H,1,3,5-6H2,2,4H3
charge 0 multiplicity 1
33 atoms
O  0.978912 -0.80812 -2.427764
O  -0.609851 0.485956 1.972038
O  3.54378 1.827215 0.407784
N  2.207633 0.51866 -0.995703
N  1.397696 1.215604 1.107431
C  -0.172084 -0.052097 -0.390482
C  -1.14773 0.952068 -1.179494
C  -0.854031 -1.448955 -0.219118
C  1.036387 -0.177712 -1.340343
C  0.167484 0.539309 0.983436
C  -2.518767 1.231734 -0.571161
C  -0.038651 -2.471443 0.586658
C  2.460009 1.233839 0.187445
C  -2.649096 2.418349 0.367154
C  -0.542011 -2.777199 1.986465
C  -3.595049 0.47969 -0.930783
C  1.045325 -3.103882 0.05796
H  -1.269434 0.485573 -2.174106
H  -0.60287 1.906401 -1.326583
H  -1.044799 -1.830117 -1.238887
H  -1.826511 -1.273327 0.270207
H  2.981688 0.484212 -1.667372
H  1.585044 1.669381 2.007861
H  -3.700343 2.582933 0.658389
H  -2.062094 2.269593 1.290754
H  -2.278641 3.343637 -0.116938
H  0.125733 -3.47795 2.516574
H  -0.647339 -1.854005 2.585018
H  -1.550249 -3.23546 1.938221
H  -3.509531 -0.35564 -1.635874
H  -4.594997 0.685125 -0.531738
H  1.376321 -2.931557 -0.972168
H  1.613567 -3.836016 0.643919
