program: Gaussian 16
title: AuCl(IPr).HFIP in HFIP
version: ES64L-G16RevC.01
method: RMN15
basis: GenECP
operation: Freq
keyword: #P
keyword: Geom=AllCheck
keyword: Guess=TCheck
keyword: SCRF=Check
keyword: GenChk
keyword: RMN15/GenECP
keyword: Freq
converged: YES YES YES YES
title: Mulliken charges:
elementType: C N N C C C C C C H H H C C C C C C H H H C H C H C H C H C H C H C H H H C H H H C H H H C H H H C H H H C H H H C H H H C H H H Au Cl H O C H C F F F C F F F
charge: -0.049203 -0.543050 -0.492043 -1.260343 -0.808571 -0.609561 0.571767 0.619573 -0.002992 0.177111 0.160142 0.159887 -0.821856 -0.459516 -0.358410 0.561402 0.352394 0.015292 0.160427 0.172278 0.160538 0.223105 0.227653 0.379585 0.228619 0.028986 0.192712 0.209512 0.219332 -0.171163 0.211056 -0.037199 0.187339 -0.501967 0.181590 0.171872 0.167533 -0.455015 0.223403 0.190070 0.168545 -0.528676 0.181650 0.165986 0.172442 -0.333764 0.172874 0.186362 0.209881 -0.504578 0.170493 0.166016 0.177221 -0.402204 0.168729 0.206827 0.181004 -0.427178 0.182812 0.165315 0.175200 -0.265353 0.195319 0.170768 0.170795 -0.189903 -0.298907 0.452001 -0.511332 -0.852766 0.273089 0.997562 -0.245227 -0.251909 -0.262624 1.153321 -0.251595 -0.267992 -0.252491
chargesum: -0.00000
title: Mulliken charges with hydrogens summed into heavy atoms:
elementType: C N N C C C C C C C C C C C C C C C C C C C C C C C C C C Au Cl O C C F F F C F F F
charge: -0.049203 -0.543050 -0.492043 -1.260343 -0.808571 -0.609561 0.748878 0.779716 0.156895 -0.821856 -0.459516 -0.358410 0.721828 0.524672 0.175830 0.450758 0.608204 0.221699 0.428844 0.039892 0.150139 0.019028 0.127003 -0.008598 0.235353 0.009153 0.154356 0.096149 0.271530 -0.189903 -0.298907 -0.059331 -0.579678 0.997562 -0.245227 -0.251909 -0.262624 1.153321 -0.251595 -0.267992 -0.252491
polarizability: 5.32697279e+02 -2.19221873e+01 6.41661055e+02 2.40215618e+00 8.08177453e+00 6.09470958e+02
1716.lowfreq: -5.8111 0.0001 0.0007 0.0017 4.8811 8.4776 14.5230 20.3958 28.1720
frequency: 13.4370 20.3441 27.9778 30.2687 32.1734 38.2420 45.3978 45.8326 51.4869 55.2319 58.1527 62.8380 66.3767 71.3595 72.2284 76.2553 83.2472 86.0401 91.7696 97.3659 104.9899 122.4512 133.3384 152.0745 157.9502 160.8290 168.8913 171.8199 182.2243 199.9040 232.4387 237.7814 241.7222 245.2636 246.1055 248.8949 258.8908 260.4197 267.0555 271.7120 274.3964 276.0984 280.0363 281.9987 292.9144 295.7933 308.0783 309.8893 312.2224 314.2503 318.6789 324.8259 326.4199 334.5605 350.8550 372.4714 406.8432 416.2144 418.0565 438.0942 440.5645 453.1179 462.6096 482.4563 508.7966 519.3391 522.5891 527.7937 544.6921 559.0030 574.1343 576.8548 592.7911 615.1137 615.4436 634.5723 640.2452 646.4020 667.3734 676.9452 712.0733 728.8698 731.3331 744.5629 760.6547 772.2202 778.9692 819.2931 822.0551 823.2307 824.2141 842.4403 879.2291 906.6494 907.6076 914.6033 916.0594 916.6520 917.2162 918.7813 927.8419 930.7873 944.1088 953.8696 955.3057 959.6845 962.7125 963.3773 965.0167 980.5865 1008.8049 1009.4904 1052.3982 1053.4953 1063.7827 1065.1052 1093.7442 1099.3128 1124.7767 1127.5499 1130.5162 1130.9048 1134.2677 1136.9786 1139.5443 1152.3096 1158.0010 1159.5932 1161.3987 1169.5311 1169.6226 1189.4297 1189.7114 1190.4926 1201.1982 1239.1591 1243.8916 1249.6259 1264.2960 1273.9482 1275.7877 1282.5233 1290.9708 1305.7092 1308.6226 1309.1039 1313.6139 1318.5489 1324.0257 1325.3805 1342.4960 1355.5796 1367.4302 1373.3493 1376.7335 1377.4413 1378.3983 1379.7796 1382.1398 1395.2623 1396.2739 1397.7645 1397.9600 1403.1831 1409.3183 1440.0613 1448.7720 1449.1620 1449.5856 1452.6837 1453.4384 1454.4455 1457.4691 1459.3825 1460.4700 1465.2143 1466.5724 1467.3446 1468.1140 1469.4364 1470.4809 1473.8533 1476.1547 1482.1295 1507.5671 1508.7669 1523.8353 1531.5489 1621.0703 1654.5654 1656.1009 1662.7076 1664.9647 3039.3604 3043.6615 3044.3543 3052.0541 3054.0037 3059.1156 3063.4723 3063.9698 3076.6887 3077.3257 3079.0016 3083.2421 3119.2431 3122.9951 3123.8057 3128.1434 3130.3965 3130.5261 3132.4444 3133.1985 3134.2116 3138.2753 3139.5441 3139.8549 3140.1874 3141.3720 3141.6156 3146.1752 3147.1040 3216.2861 3220.2882 3229.0438 3231.3904 3241.8127 3243.2884 3318.9007 3337.6736 3701.9537
redmass: 11.1854 8.3671 7.9548 3.9966 5.3752 10.5180 7.8601 6.3346 3.9469 7.4954 4.1077 4.3490 4.1049 3.8982 12.9560 3.9083 4.9219 3.7796 3.2086 5.7663 11.8233 3.9235 3.1450 3.9908 4.4018 7.1745 4.3560 4.7232 3.4671 3.2177 1.3300 1.9047 1.5066 1.2708 3.8120 1.2871 4.3657 1.9131 1.7795 1.8875 1.4120 2.1375 1.4921 1.4278 1.4528 4.7324 1.7323 2.9624 2.3218 3.3501 4.2282 3.9785 16.3728 3.4000 4.6668 2.4724 3.8753 3.9929 3.1328 2.5765 2.6224 3.9497 11.3173 3.8580 12.9764 4.4385 4.8503 17.1487 13.0001 3.7064 2.8017 2.9060 3.4611 10.6201 3.2150 3.8927 3.9379 3.1899 4.5810 9.6948 3.3390 5.0937 10.0437 5.2355 1.5855 1.9106 1.8612 2.3899 2.5595 3.5164 3.2102 5.6350 1.3745 2.1388 2.0573 1.1641 1.1854 1.1739 1.1675 4.5958 1.3745 1.3791 6.4474 2.0034 2.0018 1.4206 1.4553 1.4208 1.4571 4.7448 1.3341 1.3304 1.7237 1.7195 1.4902 1.4937 1.7349 2.3060 1.5996 2.0769 2.1814 1.8627 4.0857 2.2202 1.6313 2.5428 2.0857 2.1396 1.5325 1.2844 1.2747 1.6525 1.6649 5.6638 11.6527 1.9640 11.8605 3.3764 2.2092 1.6882 1.7001 3.0474 2.3620 2.9548 1.5146 1.4980 1.4654 1.5912 2.6189 2.7577 2.2041 1.7432 3.4396 1.6456 1.4286 1.7193 1.4011 1.3259 1.3307 1.3951 1.2727 1.2887 1.2944 2.5913 2.8490 2.0870 1.0526 1.0468 1.0570 1.0500 1.4645 1.2279 1.3450 1.1582 1.0709 1.1303 1.1373 1.0704 1.0682 1.0483 1.1445 1.1278 1.1211 2.0003 2.7915 2.8135 5.1235 5.7124 5.5211 6.5339 6.6922 8.0068 8.0184 1.0358 1.0360 1.0367 1.0363 1.0367 1.0362 1.0369 1.0369 1.0834 1.0835 1.0836 1.0833 1.1017 1.1016 1.1020 1.1025 1.1029 1.1023 1.1029 1.1024 1.0865 1.1026 1.1023 1.1023 1.1033 1.1022 1.1022 1.1032 1.1032 1.0881 1.0873 1.0902 1.0910 1.0968 1.0967 1.0924 1.1118 1.0678
irintensity: 0.2839 0.4746 0.4245 0.2871 0.1296 2.3640 1.0025 2.3581 0.4699 0.5347 1.4698 1.1076 0.5430 0.8300 0.2539 0.4566 0.2919 0.5381 0.1644 0.8963 2.9860 0.1075 0.0780 1.1284 2.1552 4.3333 1.1650 1.2147 2.5543 0.9638 0.9269 0.9835 7.8748 2.5853 11.5285 0.8951 3.5527 0.0883 1.6125 10.2129 28.2563 6.9133 1.6742 0.5631 1.8548 8.6680 17.6496 0.8839 1.2970 4.1469 38.8393 16.7509 2.2201 3.3849 4.8836 25.0786 3.2916 2.2090 1.5663 1.5733 1.6020 15.1673 22.2583 1.1686 23.9346 0.6214 0.9241 10.0696 6.2543 5.2749 0.2943 0.0704 0.4962 2.4404 0.2145 4.3868 1.8751 7.3967 0.1878 73.6443 45.3660 0.3293 45.2775 5.2472 66.0879 75.5961 15.7616 47.2608 24.4110 4.0895 6.6336 53.0349 0.0528 0.7241 1.0321 2.7819 1.6602 3.9066 1.9762 64.1214 0.1370 1.7853 15.2374 8.0688 16.4232 1.0869 5.2902 0.6821 5.2417 4.4298 0.7616 1.3617 20.3634 2.1765 5.2464 34.2435 5.1182 0.0778 4.0969 8.2829 1.3800 3.3792 241.5382 1.4325 13.5300 1.1075 4.0536 53.5724 484.9007 0.1132 0.2545 0.7197 13.4360 284.4254 45.2255 32.2555 541.7179 231.0414 1.4768 12.3050 14.5091 64.4408 15.8286 279.6559 0.4678 0.2439 1.0354 0.9842 0.2332 3.9566 0.2000 60.4619 13.2294 2.6488 2.1229 9.1391 18.3372 2.7056 21.0973 4.7674 6.2059 9.4444 10.0279 17.7497 196.7361 51.6176 3.1255 4.3484 0.4813 0.4734 13.9680 10.7291 5.0077 9.8436 5.7289 25.8277 11.0639 13.6525 12.8226 17.3074 15.0452 14.2349 1.2813 7.2696 10.9727 13.9467 1.1408 352.4566 5.6957 1.3191 1.1367 9.6935 16.4143 37.0093 60.2984 20.3246 55.7321 32.8378 51.3224 50.5795 47.6235 0.8934 30.0742 25.7467 21.9303 57.5920 69.3439 59.4962 58.2212 75.8192 44.6555 65.0554 49.8903 15.8229 21.4051 70.3830 118.9043 53.7067 70.7758 74.4486 54.0441 54.4536 5.1464 3.2068 12.1764 14.9308 27.8277 27.2893 19.9351 6.4734 1016.5118
temp: 298.150 k
press: 1.00000 atm
elementType: 6 7 7 6 6 6 6 6 6 1 1 1 6 6 6 6 6 6 1 1 1 6 1 6 1 6 1 6 1 6 1 6 1 6 1 1 1 6 1 1 1 6 1 1 1 6 1 1 1 6 1 1 1 6 1 1 1 6 1 1 1 6 1 1 1 79 17 1 8 6 1 6 9 9 9 6 9 9 9
symmnumber: 1
zpe: 1670683.6 jmol-1
zpe.correction: 0.636330 hartree
zpe.thermalcorrener: 0.681131 hartree
zpe.thermalcorrenthalpy: 0.682075 hartree
zpe.thermalcorrgfe: 0.554975 hartree
zpe.sumelectzpe: -2542.874450 hartree
zpe.sumelectthermal: -2542.829649 hartree
zpe.sumelectthermalent: -2542.828705 hartree
zpe.sumelectthermalfe: -2542.955805 hartree
dipole: -11.8207 -7.0048 -0.5602
dipole: 13.7517
quadrupole: -268.9007 -259.6756 -258.0661
quadrupole: 4.7741 1.1796 -1.2053
quadrupole: -6.6866 2.5385 4.1480 4.7741 1.1796 -1.2053
hfenergy: -2543.51078 hartree
pointgroup: C01 [X(C30H38Au1Cl1F6N2O1)]
dipole: -4.6506127 -2.7559101 -0.2203841 debye
polarizability: 532.6972795|-21.9221873|641.661055|2.4021562|8.0817745|609.4709581 unknown
InChI: InChI=1S/C27H36N2.C3H2F6O.Au.ClH/c1-18(2)22-11-9-12-23(19(3)4)26(22)28-15-16-29(17-28)27-24(20(5)6)13-10-14-25(27)21(7)8;4-2(5,6)1(10)3(7,8)9;;/h9-16,18-21H,1-8H3;1,10H;;1H/q;;+1;/p-1
charge 0 multiplicity 1
79 atoms
C  -1.22098677 -1.27026612 -0.17119351
N  -2.22502713 -0.3692319 -0.08938268
N  -1.82869741 -2.47778097 -0.18162672
C  -2.07446157 1.06202313 -0.10327175
C  -1.92127119 1.70017334 -1.34346685
C  -2.15159854 1.74824707 1.12210033
C  -1.85657779 3.10098867 -1.33724923
C  -2.09600302 3.14563087 1.07508344
C  -1.9571743 3.81406134 -0.14351396
H  -1.7288467 3.63693734 -2.27661685
H  -2.15009023 3.72095577 1.99652736
H  -1.91598791 4.90101718 -0.15882727
C  -1.10417962 -3.71814552 -0.1764678
C  -0.93781254 -4.39931068 -1.39409411
C  -0.58549542 -4.16375729 1.04856182
C  -0.2012226 -5.5889208 -1.35880625
C  0.14128907 -5.36209331 1.03292834
C  0.33268535 -6.06279881 -0.15761594
H  -0.03643908 -6.15166831 -2.27474438
H  0.55831651 -5.75059531 1.96044829
H  0.90241549 -6.98949462 -0.15163525
C  -3.45782994 -1.01030837 -0.04744343
H  -4.38503207 -0.45614072 0.01015076
C  -3.20660713 -2.34279174 -0.09278918
H  -3.86677106 -3.19974099 -0.07608197
C  -2.19448494 0.99602623 2.4427618
H  -2.68102801 0.02514084 2.2742732
C  -1.80428245 0.92987982 -2.6489955
H  -1.94408565 -0.14067239 -2.44297791
C  -0.82284497 -3.41527886 2.35156448
H  -1.3125948 -2.45759003 2.12731911
C  -1.48427525 -3.82618422 -2.69301019
H  -2.36172807 -3.2113723 -2.44981932
C  -2.98473083 1.72742452 3.52991558
H  -2.4688426 2.63759714 3.86101995
H  -3.98791032 2.00791563 3.18590844
H  -3.09443108 1.07912227 4.40739957
C  -0.75614461 0.73413451 2.91893912
H  -0.17272989 0.17137477 2.17619842
H  -0.24045159 1.68911846 3.09444169
H  -0.7587222 0.16723846 3.85943001
C  -2.88640552 1.35020967 -3.64955331
H  -2.77303345 2.40229808 -3.94123848
H  -2.81634556 0.74268665 -4.56043586
H  -3.89152132 1.21978591 -3.22921941
C  -0.40422762 1.11775463 -3.24835007
H  -0.28411914 0.49807421 -4.14654923
H  -0.24527852 2.16503991 -3.53845145
H  0.38129818 0.84011887 -2.5312295
C  -1.93694435 -4.90557779 -3.67918665
H  -2.63034912 -5.61707803 -3.21419878
H  -2.44802214 -4.43870067 -4.52961514
H  -1.08574188 -5.46920786 -4.08155302
C  -0.43594526 -2.91437067 -3.34944012
H  -0.84632471 -2.44666464 -4.25420618
H  -0.09885615 -2.11953369 -2.670034
H  0.44677601 -3.50163428 -3.63867942
C  -1.77230124 -4.21792713 3.24940267
H  -1.33185102 -5.18738106 3.51846208
H  -1.97945855 -3.67045354 4.17729038
H  -2.72781339 -4.40665683 2.7423571
C  0.49142869 -3.09857036 3.07204015
H  1.16933839 -2.52093195 2.42874349
H  0.29464858 -2.51044567 3.97722807
H  1.01202404 -4.01528 3.37818085
Au 0.74422204 -0.9681247 -0.22610201
Cl 3.033418 -0.53581592 -0.26376951
H  1.21147633 1.40743982 -0.00471808
O  0.99751805 2.33908563 0.19873345
C  2.15291517 3.10810923 0.26549572
H  3.07328645 2.53919887 0.07903867
C  2.06884662 4.19464891 -0.81169721
F  1.8717827 3.61816184 -2.00577673
F  1.05279591 5.04556799 -0.60472611
F  3.19544714 4.91818444 -0.88591758
C  2.23997414 3.67327112 1.68550298
F  1.10019236 4.27772501 2.05208679
F  3.23727271 4.55778889 1.82721282
F  2.45454007 2.66877221 2.54837015
