program: Orca
programVersion: 5.0.2
elementType: N H C H C O C C O N H C H H H O H H S H C O C H H C H H C H N H H C O O H H
charge: 1
multiplicity: 1
keywords: wB97X-D3BJ Opt Freq def2-TZVPP def2/J RIJCOSX VeryTightSCF
keywords: PAL8 defgrid3 TightOpt
frequency: 0.00 0.00 0.00 0.00 0.00 0.00 22.12 38.75 42.69 47.29 57.74 78.71 80.83 100.42 107.18 118.47 144.82 151.10 194.91 227.03 247.35 254.61 271.15 280.86 290.65 303.43 321.82 348.62 358.54 370.90 383.03 463.67 482.41 508.51 522.72 533.14 539.17 545.31 555.79 638.22 640.20 655.57 689.45 706.43 740.20 753.71 762.31 791.37 831.43 833.72 876.58 882.55 905.73 924.22 976.97 1015.37 1022.86 1032.89 1068.51 1101.79 1112.03 1120.40 1140.64 1158.01 1167.02 1191.55 1198.13 1208.36 1218.81 1288.91 1295.45 1303.38 1315.16 1333.22 1336.12 1343.22 1355.26 1384.82 1398.44 1412.55 1423.90 1435.92 1452.87 1467.62 1482.48 1483.31 1507.50 1556.53 1579.09 1608.10 1630.20 1666.08 1734.64 1756.23 1844.93 1886.20 2759.61 3092.86 3093.28 3097.29 3104.63 3106.13 3124.13 3154.63 3155.01 3165.35 3167.43 3198.37 3309.75 3561.82 3657.21 3666.54 3792.20 3803.44
frequency: 22.12 38.75 42.69 47.29 57.74 78.71 80.83 100.42 107.18 118.47 144.82 151.10 194.91 227.03 247.35 254.61 271.15 280.86 290.65 303.43 321.82 348.62 358.54 370.90 383.03 463.67 482.41 508.51 522.72 533.14 539.17 545.31 555.79 638.22 640.20 655.57 689.45 706.43 740.20 753.71 762.31 791.37 831.43 833.72 876.58 882.55 905.73 924.22 976.97 1015.37 1022.86 1032.89 1068.51 1101.79 1112.03 1120.40 1140.64 1158.01 1167.02 1191.55 1198.13 1208.36 1218.81 1288.91 1295.45 1303.38 1315.16 1333.22 1336.12 1343.22 1355.26 1384.82 1398.44 1412.55 1423.90 1435.92 1452.87 1467.62 1482.48 1483.31 1507.50 1556.53 1579.09 1608.10 1630.20 1666.08 1734.64 1756.23 1844.93 1886.20 2759.61 3092.86 3093.28 3097.29 3104.63 3106.13 3124.13 3154.63 3155.01 3165.35 3167.43 3198.37 3309.75 3561.82 3657.21 3666.54 3792.20 3803.44
formula: C10H18N3O6S
InChI: InChI=1S/C10H18N3O6S/c11-5(10(18)19)1-2-7(14)13-6(4-20)9(17)12-3-8(15)16/h5-6,12-13,15,18,20H,1-4H2,11H3
38 atoms
N  -0.468502 2.973655 2.038225
H  -0.864711 3.561295 1.323119
C  -0.276051 3.52369 3.357786
H  -0.79937 4.475337 3.434696
C  1.182303 3.730924 3.728959
O  2.125903 3.210339 3.188617
C  -0.299142 1.672456 1.76738
C  -0.705484 1.230728 0.349109
O  0.128321 0.869539 2.594725
N  0.018238 0.023093 0.005886
H  -0.427873 2.017182 -0.353687
C  -2.210436 0.958224 0.23751
H  -0.448122 -0.860196 0.12854
H  -2.404313 0.54742 -0.75406
H  -2.525762 0.215335 0.971356
O  1.281071 4.547317 4.777771
H  2.213487 4.642939 5.014895
H  -0.696328 2.852816 4.11221
S  -3.253273 2.428184 0.370165
H  -3.411491 2.40742 1.697858
C  1.366105 0.041258 0.007844
O  1.982664 1.106911 0.01825
C  2.076607 -1.286385 0.119969
H  1.459503 -2.093008 -0.279065
H  2.991867 -1.242821 -0.469349
C  2.391866 -1.605207 1.593274
H  2.796925 -2.615624 1.640435
H  1.473338 -1.593369 2.184935
C  3.420195 -0.708663 2.28872
H  3.599117 -1.113689 3.288103
N  2.943446 0.693434 2.471828
H  3.569051 1.25571 3.042977
H  2.843488 1.153143 1.547583
C  4.771686 -0.721991 1.578504
O  5.1902 -1.668994 0.982757
O  5.430962 0.435354 1.748402
H  6.289462 0.36945 1.306732
H  1.992117 0.733295 2.868281
totalener: -1406.26066437 hartree
nucrepener: 1879.20289899 hartree
electener: -3285.46356336 hartree
oneelecener: -5642.48994677 hartree
twoeener: 2357.02638341 hartree
kineticenergy: 1400.68901902 hartree
exchangeener: -105.333907646631 hartree
correlationener: -7.055112842797 hartree
xcener: -112.389020489428 hartree
temp: 298.15 k
press: 1.00 atm
thermalcorrenthalpy: 0.00094421 hartree
totalenthalpy: -1406.01206818 hartree
totalentropycorr: -0.06545990 hartree
gibbsenthalpy: -1406.07752808 hartree
gibbsminuselec: 0.26440660 hartree
chargesum: 1.0000000
charge: -0.167170 0.189391 -0.091966 0.151206 0.329369 -0.371218 0.266281 0.057376 -0.462561 -0.167693 0.132944 -0.187065 0.173356 0.151095 0.133842 -0.240969 0.241842 0.138249 -0.131772 0.107560 0.220535 -0.402419 -0.181539 0.117429 0.135789 -0.173781 0.146130 0.122622 -0.015918 0.148735 -0.055522 0.225852 0.237500 0.273463 -0.255014 -0.281019 0.252689 0.232372
charge: 0.348698 -0.021749 -0.035408 0.041987 -0.424804 0.091852 -0.371233 -0.138351 0.066800 0.349846 0.039842 -0.239645 -0.013264 0.017757 0.011077 0.389308 -0.077409 0.044263 0.510063 -0.149722 -0.362404 0.101543 0.002883 0.035156 0.041532 0.006426 0.046530 0.031067 -0.053734 0.049643 0.598060 0.034998 -0.004612 -0.434601 0.162142 0.365477 -0.069420 0.009407
qa: -0.1672 0.1894 -0.0920 0.1512 0.3294 -0.3712 0.2663 0.0574 -0.4626 -0.1677 0.1329 -0.1871 0.1734 0.1511 0.1338 -0.2410 0.2418 0.1382 -0.1318 0.1076 0.2205 -0.4024 -0.1815 0.1174 0.1358 -0.1738 0.1461 0.1226 -0.0159 0.1487 -0.0555 0.2259 0.2375 0.2735 -0.2550 -0.2810 0.2527 0.2324
va: 3.2185 1.0261 3.8145 1.0068 4.2830 2.1095 4.1607 3.8310 2.0443 3.2408 1.0192 3.9263 1.0219 0.9967 1.0012 2.2526 1.0160 1.0122 2.1665 1.0231 4.2139 2.0862 3.8513 1.0105 1.0293 3.8751 1.0106 1.0233 3.8241 0.9989 3.6138 0.9922 1.0468 4.3861 2.2469 2.2067 1.0104 1.0292
dispcorr: -0.081764639 hartree
energy: -1406.347850909275
dipole: -2.20533 2.53048 0.32515 -6.06289 5.85998 -0.20291 1.53467 -0.22659 1.30808
magnitude: 1.36308 au
magnitude: 3.46467 debye
zeropoint: 0.31131293 hartree
thermalvibcorrection: 0.01842463 hartree
thermalrotcorrection: 0.00141627 hartree
thermaltrasncorrection: 0.00141627 hartree
thermaltotal: -1406.01528081 hartree
thermalcorr: 0.02125717 hartree
nonthermalcorr: 0.31131293 hartree
totalcorr: 0.33257010 hartree
totalenthalpy: -1406.01433660 hartree
