program: Orca
programVersion: 5.0.2
elementType: N H C H C O C C O N H C H H H O H H S H C O C H H C H H C H N H H C O O H H
charge: 1
multiplicity: 1
keywords: wB97X-D3BJ Opt Freq def2-TZVPP def2/J RIJCOSX VeryTightSCF
keywords: PAL8 defgrid3 TightOpt
frequency: 0.00 0.00 0.00 0.00 0.00 0.00 28.12 35.89 58.53 62.97 69.55 89.27 99.30 122.48 149.44 152.03 163.58 188.30 203.89 214.92 227.82 259.28 273.31 288.16 304.99 314.27 339.00 359.96 392.37 421.01 438.46 448.66 468.33 502.45 513.26 540.59 566.92 586.99 608.29 628.85 643.87 652.16 713.80 729.64 733.12 742.23 793.00 801.75 819.91 856.46 860.19 904.23 929.34 934.59 978.45 994.09 1013.99 1033.65 1059.68 1069.01 1102.97 1125.49 1139.90 1146.24 1170.24 1199.36 1235.55 1245.85 1258.39 1277.05 1284.50 1315.59 1326.35 1328.79 1330.87 1371.31 1375.38 1378.06 1385.50 1415.07 1421.79 1436.64 1440.42 1467.08 1484.00 1489.18 1493.88 1554.15 1564.35 1591.62 1643.31 1697.42 1739.55 1775.20 1817.41 1888.07 2771.54 3012.05 3077.43 3079.87 3085.74 3097.29 3105.71 3121.12 3138.03 3155.29 3161.52 3175.61 3195.06 3557.62 3573.44 3675.05 3680.47 3790.82
frequency: 28.12 35.89 58.53 62.97 69.55 89.27 99.30 122.48 149.44 152.03 163.58 188.30 203.89 214.92 227.82 259.28 273.31 288.16 304.99 314.27 339.00 359.96 392.37 421.01 438.46 448.66 468.33 502.45 513.26 540.59 566.92 586.99 608.29 628.85 643.87 652.16 713.80 729.64 733.12 742.23 793.00 801.75 819.91 856.46 860.19 904.23 929.34 934.59 978.45 994.09 1013.99 1033.65 1059.68 1069.01 1102.97 1125.49 1139.90 1146.24 1170.24 1199.36 1235.55 1245.85 1258.39 1277.05 1284.50 1315.59 1326.35 1328.79 1330.87 1371.31 1375.38 1378.06 1385.50 1415.07 1421.79 1436.64 1440.42 1467.08 1484.00 1489.18 1493.88 1554.15 1564.35 1591.62 1643.31 1697.42 1739.55 1775.20 1817.41 1888.07 2771.54 3012.05 3077.43 3079.87 3085.74 3097.29 3105.71 3121.12 3138.03 3155.29 3161.52 3175.61 3195.06 3557.62 3573.44 3675.05 3680.47 3790.82
formula: C10H18N3O6S
InChI: InChI=1S/C10H18N3O6S/c11-5(10(18)19)1-2-7(14)13-6(4-20)9(17)12-3-8(15)16/h5-6,12-13,15,18,20H,1-4H2,11H3
38 atoms
N  0.048119 1.938656 -2.115994
H  -0.113194 0.979551 -2.370224
C  0.831618 2.761519 -3.022648
H  0.735766 2.373814 -4.033283
C  2.295625 2.679036 -2.601999
O  3.074898 1.892573 -3.100342
C  -0.13329 2.312194 -0.824572
C  -0.770388 1.228821 0.061482
O  0.151963 3.426689 -0.421325
N  0.042831 0.011581 0.003351
H  -1.723167 0.976818 -0.415528
C  -1.088631 1.717995 1.475674
H  -0.427399 -0.8744 0.078304
H  -1.578122 2.68824 1.403117
H  -1.800183 1.026337 1.929471
O  2.669998 3.459698 -1.59897
H  1.883188 3.83951 -1.159797
H  0.469767 3.789136 -2.988855
S  0.285573 1.800599 2.637775
H  0.930566 2.806317 2.038807
C  1.388831 0.02848 0.007501
O  2.010296 1.091205 0.007627
C  2.116754 -1.294989 -0.071579
H  2.579679 -1.471298 0.903708
H  1.41342 -2.111759 -0.239233
C  3.177194 -1.318424 -1.188551
H  2.77209 -0.898793 -2.114015
H  3.421459 -2.358319 -1.403269
C  4.516502 -0.645943 -0.87628
H  4.829965 -0.908003 0.138624
N  4.441801 0.842599 -0.930665
H  4.210456 1.197605 -1.879348
H  3.621216 1.135482 -0.348791
C  5.617992 -1.162764 -1.804846
O  5.664497 -2.283435 -2.213783
O  6.533673 -0.212561 -2.053128
H  7.228183 -0.590712 -2.611099
H  5.308834 1.277689 -0.626804
totalener: -1406.24906658 hartree
nucrepener: 1931.35820721 hartree
electener: -3337.60727379 hartree
oneelecener: -5746.23917082 hartree
twoeener: 2408.63189704 hartree
kineticenergy: 1400.67454579 hartree
exchangeener: -105.331587870631 hartree
correlationener: -7.060142042383 hartree
xcener: -112.391729913013 hartree
temp: 298.15 k
press: 1.00 atm
thermalcorrenthalpy: 0.00094421 hartree
totalenthalpy: -1406.00374660 hartree
totalentropycorr: -0.06412091 hartree
gibbsenthalpy: -1406.06786752 hartree
gibbsminuselec: 0.26485710 hartree
chargesum: 1.0000000
charge: -0.182941 0.179228 -0.124773 0.140655 0.332125 -0.366857 0.275004 0.032081 -0.395006 -0.193128 0.148747 -0.168774 0.191250 0.130963 0.124974 -0.245563 0.256474 0.155567 -0.140229 0.118542 0.315221 -0.439447 -0.185060 0.124689 0.109755 -0.207909 0.108569 0.155580 0.018991 0.135232 -0.072001 0.225997 0.220404 0.280751 -0.252771 -0.283370 0.254434 0.222597
charge: 0.332897 -0.022142 -0.031400 0.039352 -0.428239 0.118379 -0.375838 -0.122606 0.109769 0.347509 0.044026 -0.243186 -0.012851 0.017990 0.012594 0.388698 -0.105474 0.037074 0.493925 -0.146090 -0.368371 0.144665 0.001339 0.043138 0.033342 0.008799 0.033516 0.045328 -0.055099 0.047630 0.597581 -0.005271 -0.045144 -0.429695 0.163703 0.363503 -0.068012 0.034663
qa: -0.1829 0.1792 -0.1248 0.1407 0.3321 -0.3669 0.2750 0.0321 -0.3950 -0.1931 0.1487 -0.1688 0.1913 0.1310 0.1250 -0.2456 0.2565 0.1556 -0.1402 0.1185 0.3152 -0.4394 -0.1851 0.1247 0.1098 -0.2079 0.1086 0.1556 0.0190 0.1352 -0.0720 0.2260 0.2204 0.2808 -0.2528 -0.2834 0.2544 0.2226
va: 3.1938 1.0228 3.8900 1.0090 4.1630 2.1347 4.1768 3.7726 2.1123 3.2013 0.9959 4.0202 1.0043 1.0109 1.0006 2.2292 1.0348 1.0010 2.1825 1.0270 4.1355 2.0336 3.8349 1.0121 1.0149 3.9144 1.0221 1.0190 3.8131 1.0051 3.5614 1.0714 1.0764 4.3797 2.2443 2.2098 1.0094 0.9866
dispcorr: -0.083726200 hartree
energy: -1406.338440337023
dipole: -3.44022 3.57730 0.13708 -4.54695 3.21965 -1.32730 -0.52903 -0.18259 -0.71163
magnitude: 1.51226 au
magnitude: 3.84385 debye
zeropoint: 0.31154972 hartree
thermalvibcorrection: 0.01773939 hartree
thermalrotcorrection: 0.00141627 hartree
thermaltrasncorrection: 0.00141627 hartree
thermaltotal: -1406.00631868 hartree
thermalcorr: 0.02057194 hartree
nonthermalcorr: 0.31154972 hartree
totalcorr: 0.33212166 hartree
totalenthalpy: -1406.00537447 hartree
