program: Orca
programVersion: 5.0.2
elementType: N H C H C O C C O N H C H H H O H H S H C O C H H C H H C H N H H C O O H H
charge: 1
multiplicity: 1
keywords: wB97X-D3BJ Opt Freq def2-TZVPP def2/J RIJCOSX VeryTightSCF
keywords: PAL8 defgrid3 TightOpt
frequency: 0.00 0.00 0.00 0.00 0.00 0.00 19.44 29.20 33.84 45.63 53.27 67.52 71.38 85.90 94.65 114.29 148.16 185.48 196.69 233.44 245.95 264.07 284.45 287.99 295.37 309.66 333.86 355.41 361.20 384.14 445.80 461.00 473.22 524.90 530.32 544.96 558.03 583.36 607.41 615.75 641.89 666.71 675.32 734.28 738.00 741.66 761.54 799.28 814.58 834.20 867.88 874.44 889.77 932.99 972.81 1015.32 1024.94 1036.06 1042.61 1076.47 1100.62 1107.62 1144.21 1158.58 1167.14 1191.85 1205.71 1209.45 1265.68 1272.85 1282.02 1296.27 1305.65 1332.47 1337.24 1357.50 1368.71 1386.23 1398.24 1403.10 1414.09 1427.46 1433.22 1467.60 1479.04 1483.18 1507.17 1564.90 1584.38 1601.56 1627.91 1660.90 1727.72 1755.71 1885.37 1890.80 2751.40 3094.37 3097.89 3105.76 3107.24 3111.11 3117.50 3132.24 3156.00 3162.29 3165.22 3181.80 3268.43 3565.68 3599.91 3667.09 3786.43 3789.23
frequency: 19.44 29.20 33.84 45.63 53.27 67.52 71.38 85.90 94.65 114.29 148.16 185.48 196.69 233.44 245.95 264.07 284.45 287.99 295.37 309.66 333.86 355.41 361.20 384.14 445.80 461.00 473.22 524.90 530.32 544.96 558.03 583.36 607.41 615.75 641.89 666.71 675.32 734.28 738.00 741.66 761.54 799.28 814.58 834.20 867.88 874.44 889.77 932.99 972.81 1015.32 1024.94 1036.06 1042.61 1076.47 1100.62 1107.62 1144.21 1158.58 1167.14 1191.85 1205.71 1209.45 1265.68 1272.85 1282.02 1296.27 1305.65 1332.47 1337.24 1357.50 1368.71 1386.23 1398.24 1403.10 1414.09 1427.46 1433.22 1467.60 1479.04 1483.18 1507.17 1564.90 1584.38 1601.56 1627.91 1660.90 1727.72 1755.71 1885.37 1890.80 2751.40 3094.37 3097.89 3105.76 3107.24 3111.11 3117.50 3132.24 3156.00 3162.29 3165.22 3181.80 3268.43 3565.68 3599.91 3667.09 3786.43 3789.23
formula: C10H18N3O6S
InChI: InChI=1S/C10H18N3O6S/c11-5(10(18)19)1-2-7(14)13-6(4-20)9(17)12-3-8(15)16/h5-6,12-13,15,18,20H,1-4H2,11H3
38 atoms
N  -0.25333 3.162583 1.73874
H  -0.592325 3.671876 0.939633
C  0.154786 3.915867 2.906458
H  -0.544567 4.72823 3.092214
C  1.540987 4.532444 2.798811
O  1.812027 5.636434 3.165644
C  -0.099135 1.833728 1.638815
C  -0.637881 1.208201 0.341033
O  0.391968 1.15048 2.535264
N  0.03208 -0.043183 0.084609
H  -0.430705 1.9001 -0.47903
C  -2.155363 0.991145 0.428001
H  -0.47123 -0.875131 0.359253
H  -2.647699 1.920645 0.710353
H  -2.527799 0.709306 -0.557496
O  2.460606 3.688421 2.261884
H  3.275852 4.204256 2.186536
H  0.145674 3.24531 3.766983
S  -2.665401 -0.35271 1.525441
H  -2.165879 0.153916 2.659593
C  1.374552 -0.078976 0.033822
O  2.03751 0.956408 -0.077859
C  2.030048 -1.42302 0.247318
H  1.370379 -2.228134 -0.07909
H  2.938474 -1.471175 -0.352449
C  2.344167 -1.63373 1.739905
H  2.672029 -2.663722 1.877382
H  1.439289 -1.496889 2.336688
C  3.452079 -0.762273 2.334963
H  3.596686 -1.058002 3.377315
N  3.109042 0.693369 2.344654
H  3.003257 1.032648 1.366179
H  2.177958 0.866324 2.759032
C  4.79502 -0.981938 1.641462
O  5.122986 -2.023177 1.159121
O  5.561536 0.122266 1.686974
H  6.412705 -0.076709 1.271355
H  3.817058 1.243739 2.822473
totalener: -1406.25149658 hartree
nucrepener: 1896.99227654 hartree
electener: -3303.24377312 hartree
oneelecener: -5677.11165054 hartree
twoeener: 2373.86787742 hartree
kineticenergy: 1400.67491892 hartree
exchangeener: -105.327251731756 hartree
correlationener: -7.054889087407 hartree
xcener: -112.382140819163 hartree
temp: 298.15 k
press: 1.00 atm
thermalcorrenthalpy: 0.00094421 hartree
totalenthalpy: -1406.00381489 hartree
totalentropycorr: -0.06531097 hartree
gibbsenthalpy: -1406.06912586 hartree
gibbsminuselec: 0.26434123 hartree
chargesum: 1.0000000
charge: -0.184580 0.190056 -0.077799 0.160896 0.262780 -0.250543 0.267637 0.066391 -0.469193 -0.157042 0.132133 -0.157510 0.168485 0.117257 0.152628 -0.301976 0.236751 0.128247 -0.129597 0.113304 0.214769 -0.407798 -0.183310 0.124941 0.133676 -0.172326 0.147578 0.124734 -0.010403 0.153781 -0.061813 0.229240 0.232339 0.271119 -0.247790 -0.289908 0.255151 0.217695
charge: 0.349644 -0.008637 -0.026087 0.042350 -0.428855 0.155514 -0.371313 -0.136309 0.075137 0.348624 0.042044 -0.231657 -0.033565 0.009146 0.020685 0.332336 -0.087090 0.039938 0.509968 -0.146093 -0.362312 0.094218 0.004285 0.038206 0.040712 0.006882 0.047605 0.032042 -0.051880 0.050500 0.599272 -0.010883 -0.000568 -0.433788 0.167846 0.359472 -0.068696 0.031306
qa: -0.1846 0.1901 -0.0778 0.1609 0.2628 -0.2505 0.2676 0.0664 -0.4692 -0.1570 0.1321 -0.1575 0.1685 0.1173 0.1526 -0.3020 0.2368 0.1282 -0.1296 0.1133 0.2148 -0.4078 -0.1833 0.1249 0.1337 -0.1723 0.1476 0.1247 -0.0104 0.1538 -0.0618 0.2292 0.2323 0.2711 -0.2478 -0.2899 0.2552 0.2177
va: 3.2382 1.0059 3.7849 1.0018 4.3116 2.2489 4.1649 3.8782 2.0154 3.2232 1.0109 3.9275 1.0612 1.0135 0.9956 2.1235 1.0171 1.0195 2.1897 1.0279 4.2118 2.0801 3.8500 1.0093 1.0276 3.8743 1.0111 1.0252 3.8215 0.9977 3.5889 1.0623 1.0363 4.3800 2.2525 2.1951 1.0085 0.9953
dispcorr: -0.081940387 hartree
energy: -1406.339452948499
dipole: -1.98468 2.59248 0.60780 -3.36903 3.25395 -0.11508 0.23102 0.06091 0.29193
magnitude: 0.68402 au
magnitude: 1.73864 debye
zeropoint: 0.31130755 hartree
thermalvibcorrection: 0.01829960 hartree
thermalrotcorrection: 0.00141627 hartree
thermaltrasncorrection: 0.00141627 hartree
thermaltotal: -1406.00701326 hartree
thermalcorr: 0.02113214 hartree
nonthermalcorr: 0.31130755 hartree
totalcorr: 0.33243969 hartree
totalenthalpy: -1406.00606905 hartree
