program: Orca
programVersion: 5.0.2
elementType: N H C H C O C C O N H C H H H O H H S H C O C H H C H H C H N H H C O O H H
charge: 1
multiplicity: 1
keywords: wB97X-D3BJ Opt Freq def2-TZVPP def2/J RIJCOSX VeryTightSCF
keywords: PAL8 defgrid3 TightOpt
frequency: 0.00 0.00 0.00 0.00 0.00 0.00 30.94 39.15 57.19 68.84 86.80 100.16 107.26 119.56 130.38 145.38 153.02 171.38 177.90 206.59 225.66 237.66 270.22 280.24 295.74 311.68 334.96 347.63 366.89 389.53 421.33 457.15 495.61 511.89 546.93 562.55 578.97 598.86 607.65 610.59 630.28 655.66 691.27 700.63 706.82 747.15 751.24 785.86 809.28 833.83 878.07 901.55 917.84 944.22 967.17 982.53 998.78 1043.09 1056.70 1076.85 1109.48 1110.43 1131.70 1142.89 1172.48 1213.20 1236.72 1240.99 1252.05 1264.49 1282.40 1286.40 1293.20 1319.07 1334.04 1364.16 1366.75 1386.17 1392.27 1396.02 1422.04 1427.63 1471.17 1474.63 1480.37 1480.61 1495.49 1557.53 1569.41 1582.24 1632.68 1683.03 1727.88 1793.35 1839.99 1854.72 2778.20 3075.98 3084.73 3085.06 3100.64 3118.46 3121.39 3151.61 3163.04 3183.17 3183.48 3276.07 3314.39 3507.70 3607.73 3651.86 3691.78 3787.87
frequency: 30.94 39.15 57.19 68.84 86.80 100.16 107.26 119.56 130.38 145.38 153.02 171.38 177.90 206.59 225.66 237.66 270.22 280.24 295.74 311.68 334.96 347.63 366.89 389.53 421.33 457.15 495.61 511.89 546.93 562.55 578.97 598.86 607.65 610.59 630.28 655.66 691.27 700.63 706.82 747.15 751.24 785.86 809.28 833.83 878.07 901.55 917.84 944.22 967.17 982.53 998.78 1043.09 1056.70 1076.85 1109.48 1110.43 1131.70 1142.89 1172.48 1213.20 1236.72 1240.99 1252.05 1264.49 1282.40 1286.40 1293.20 1319.07 1334.04 1364.16 1366.75 1386.17 1392.27 1396.02 1422.04 1427.63 1471.17 1474.63 1480.37 1480.61 1495.49 1557.53 1569.41 1582.24 1632.68 1683.03 1727.88 1793.35 1839.99 1854.72 2778.20 3075.98 3084.73 3085.06 3100.64 3118.46 3121.39 3151.61 3163.04 3183.17 3183.48 3276.07 3314.39 3507.70 3607.73 3651.86 3691.78 3787.87
formula: C10H18N3O6S
InChI: InChI=1S/C10H18N3O6S/c11-5(10(18)19)1-2-7(14)13-6(4-20)9(17)12-3-8(15)16/h5-6,12-13,15,18,20H,1-4H2,11H3
38 atoms
N  -0.423145 2.114915 -2.95407
H  -0.857864 2.92981 -2.559302
C  0.330346 2.247291 -4.190419
H  0.023403 1.50755 -4.926377
C  1.824609 2.039538 -3.932865
O  2.526529 1.392531 -4.670708
C  -0.188316 1.043133 -2.179641
C  -0.731848 1.020184 -0.740222
O  0.459614 0.092988 -2.612582
N  0.015438 0.007967 -0.001802
H  -1.748426 0.623353 -0.819806
C  -0.88527 2.385384 -0.038641
H  -0.395138 -0.910278 -0.050223
H  -1.821008 2.841465 -0.369618
H  -1.001503 2.195854 1.026635
O  2.336458 2.580363 -2.828721
H  1.6707 2.991268 -2.247191
H  0.167137 3.244858 -4.599555
S  0.345368 3.698247 -0.270784
H  1.369034 3.083222 0.327242
C  1.38545 0.025219 -0.049984
O  2.013163 1.065369 -0.115655
C  2.077895 -1.324148 -0.084164
H  1.98214 -1.80281 0.894141
H  1.538918 -1.96743 -0.78563
C  3.565525 -1.238012 -0.440638
H  3.943459 -2.257327 -0.560058
H  4.117819 -0.790215 0.38541
C  3.937652 -0.405941 -1.680258
H  3.796417 0.652106 -1.475981
N  3.118628 -0.728326 -2.887249
H  3.390253 -1.636097 -3.267028
H  2.107539 -0.681799 -2.693992
C  5.379077 -0.691073 -2.071823
O  5.670086 -1.339881 -3.041763
O  6.237478 -0.172037 -1.201124
H  7.137262 -0.401975 -1.474602
H  3.272393 -0.024709 -3.628951
totalener: -1406.24141648 hartree
nucrepener: 1970.33121763 hartree
electener: -3376.57263411 hartree
oneelecener: -5823.80936178 hartree
twoeener: 2447.23672767 hartree
kineticenergy: 1400.68487971 hartree
exchangeener: -105.329928063799 hartree
correlationener: -7.062614402222 hartree
xcener: -112.392542466021 hartree
temp: 298.15 k
press: 1.00 atm
thermalcorrenthalpy: 0.00094421 hartree
totalenthalpy: -1405.99847405 hartree
totalentropycorr: -0.06423094 hartree
gibbsenthalpy: -1406.06270499 hartree
gibbsminuselec: 0.26528454 hartree
chargesum: 1.0000000
charge: -0.199166 0.201999 -0.064847 0.139636 0.286474 -0.332932 0.262299 0.035569 -0.452921 -0.169948 0.136946 -0.216960 0.174926 0.149262 0.143203 -0.233302 0.214839 0.145535 -0.155221 0.155370 0.269274 -0.406323 -0.220748 0.151845 0.115116 -0.207096 0.130053 0.137705 0.016180 0.170432 -0.071623 0.221842 0.228818 0.285321 -0.297465 -0.243910 0.250583 0.249233
charge: 0.339779 -0.025764 -0.025512 0.042246 -0.444681 0.125446 -0.359728 -0.123493 0.099064 0.318764 0.050205 -0.237568 -0.017513 0.013592 0.019250 0.388330 -0.139145 0.041006 0.517462 -0.147356 -0.374785 0.108138 -0.012947 0.045954 0.028006 0.005746 0.036546 0.047132 -0.055071 0.036321 0.615784 0.043611 -0.006602 -0.440812 0.130565 0.398802 -0.066789 0.026019
qa: -0.1992 0.2020 -0.0648 0.1396 0.2865 -0.3329 0.2623 0.0356 -0.4529 -0.1699 0.1369 -0.2170 0.1749 0.1493 0.1432 -0.2333 0.2148 0.1455 -0.1552 0.1554 0.2693 -0.4063 -0.2207 0.1518 0.1151 -0.2071 0.1301 0.1377 0.0162 0.1704 -0.0716 0.2218 0.2288 0.2853 -0.2975 -0.2439 0.2506 0.2492
va: 3.2251 1.0073 3.7909 1.0203 4.2550 2.1651 4.1763 3.8944 2.0451 3.1399 0.9912 3.9288 1.0156 0.9919 1.0108 2.2135 1.0947 0.9956 2.2082 1.0247 4.1650 2.0672 3.8340 1.0024 1.0132 3.8901 1.0070 1.0173 3.7531 1.0331 3.6331 0.9973 1.0404 4.3876 2.1940 2.2682 1.0081 1.0264
dispcorr: -0.086596423 hartree
energy: -1406.334194345948
dipole: -5.05216 3.75344 -1.29872 -5.72944 4.50200 -1.22744 3.98294 -3.37376 0.60918
magnitude: 1.88796 au
magnitude: 4.79881 debye
zeropoint: 0.31164402 hartree
thermalvibcorrection: 0.01793986 hartree
thermalrotcorrection: 0.00141627 hartree
thermaltrasncorrection: 0.00141627 hartree
thermaltotal: -1406.00177792 hartree
thermalcorr: 0.02077240 hartree
nonthermalcorr: 0.31164402 hartree
totalcorr: 0.33241642 hartree
totalenthalpy: -1406.00083371 hartree
