program: Gaussian 09
title: 000047410
version: EM64L-G09RevD.01
frameworkgroup: C1[X(C6H9NO3)]
method: RPBEPBE
basis: SDD
operation: Freq
keyword: #pfreq=noraman
keyword: PBEPBE/SDD
title: #p freq=noraman PBEPBE/SDD
converged: YES YES NO NO
title: Mulliken charges:
elementType: O O O N C C C C C C H H H H H H H H H
charge: -0.289079 -0.397963 -0.245732 -0.402697 -0.347111 -0.469922 -0.469690 0.302894 -0.389466 0.171161 0.234338 0.265204 0.241252 0.241146 0.265001 0.338429 0.281035 0.280768 0.390432
chargesum: 0.00000
title: Mulliken charges with hydrogens summed into heavy atoms:
elementType: O O O N C C C C C C
charge: -0.289079 -0.007531 -0.245732 -0.064269 -0.112773 0.036535 0.036457 0.302894 0.172338 0.171161
polarizability: 1.09762305e+02 1.04363372e+00 7.62552336e+01 2.06907018e-03 9.30670596e-03 5.43468604e+01
1716.lowfreq: -12.3394 -5.4374 -0.0011 -0.0010 -0.0005 3.6666 26.4510 61.2070 69.9530
frequency: 25.9581 61.1971 69.9280 95.2162 165.6705 221.4876 265.0619 290.6192 315.7309 489.9894 497.8771 575.6474 589.2298 634.2929 648.5726 711.0824 782.9160 807.0994 819.8344 888.8368 894.0164 956.0864 988.7206 1048.0033 1057.6959 1079.2548 1087.6402 1089.5756 1121.1972 1176.9369 1193.6706 1202.8186 1224.2804 1264.5308 1352.1219 1396.5843 1424.1633 1446.8207 1460.8701 1492.9964 1599.7170 1663.6180 2992.0133 3029.6071 3101.9144 3107.6717 3127.9453 3207.8450 3226.0499 3522.8703 3524.3267
redmass: 3.6883 9.0279 3.3853 5.4896 2.4220 4.9043 8.5288 3.0022 5.9787 1.7959 4.2123 5.6348 1.1184 1.3967 3.0609 4.6102 1.1813 2.0140 2.9409 2.1228 3.9934 3.6954 2.0813 1.3230 2.4078 1.1635 1.2523 1.4917 3.0211 1.3634 1.0903 1.6932 2.2083 1.5517 1.9149 1.9741 1.0874 1.3577 1.1147 2.4223 6.8454 7.9373 1.0600 1.0996 1.0503 1.0614 1.0914 1.1180 1.1161 1.0735 1.0687
irintensity: 0.5804 6.7911 2.1635 6.0782 1.8198 8.5220 3.5305 7.3028 6.9880 43.0616 45.9157 22.9475 34.8267 201.0448 1.0044 4.0810 4.4501 11.5901 3.0982 6.9224 13.9922 104.0025 1.0221 34.9683 156.9094 16.1144 0.0443 7.5810 106.0097 0.3554 0.0161 21.0093 6.3166 1.8614 83.4049 107.6318 11.8988 13.6805 38.3383 355.5216 192.0092 157.8931 29.6735 6.2072 16.9805 12.2181 12.6889 0.3841 11.9862 97.7733 11.4014
temp: 298.150 k
press: 1.00000 atm
elementType: 8 8 8 7 6 6 6 6 6 6 1 1 1 1 1 1 1 1 1
symmnumber: 1
zpe: 388892.9 jmol-1
zpe.correction: 0.148121 hartree
zpe.thermalcorrener: 0.158530 hartree
zpe.thermalcorrenthalpy: 0.159474 hartree
zpe.thermalcorrgfe: 0.110443 hartree
zpe.sumelectzpe: -513.678734 hartree
zpe.sumelectthermal: -513.668325 hartree
zpe.sumelectthermalent: -513.667381 hartree
zpe.sumelectthermalfe: -513.716412 hartree
dipole: 1.6146 -2.1358 0.0051
dipole: 2.6774
quadrupole: -46.1824 -66.0993 -58.0329
quadrupole: 7.3075 0.0120 -0.0109
quadrupole: 10.5891 -9.3278 -1.2614 7.3075 0.0120 -0.0109
hfenergy: -513.8268551 hartree
pointgroup: C01 [X(C6H9N1O3)]
dipole: 0.533567 0.4631403 0.781288 debye
dipolederiv: -0.731128 0.0650435 0.0095835 -0.0416116 -0.5582729 -0.2687262 -0.1432601 -0.2439811 -0.7575558 -1.2601402 0.3121464 0.2547588 0.2895872 -0.4680992 -0.0027296 0.2240545 0.0022256 -0.3665136 -0.7422525 0.0081336 -0.0866057 0.1411911 -0.5378844 -0.2897836 0.1042548 -0.3197176 -0.7463288 -1.2604743 -0.0743077 -0.2968242 -0.1354338 -0.4246331 0.002027 -0.3837116 0.0154786 -0.5151457 -0.7868454 0.1301059 -0.008572 0.0947199 0.0095503 -0.0184359 -0.0595647 -0.0096956 0.0097122 0.1779284 -0.045154 -0.0444124 0.2052316 -0.0232958 0.1095745 -0.0267522 0.0785874 -0.0426138 0.1134879 -0.0853797 -0.0309338 -0.1532078 -0.0589352 0.0416877 0.2120859 0.0292487 0.0587804 1.7852684 -0.0679636 0.2730745 -0.0526272 0.4920582 0.3887315 0.2963488 0.3854502 0.8293546 0.2982698 -0.104058 -0.1515337 -0.2807927 0.2259636 -0.2033929 -0.4031104 -0.1621789 -0.0014217 1.6609098 -0.2231194 0.0112917 -0.2678768 0.6025636 0.5044995 -0.0549272 0.5144283 0.9304794 -0.0289536 -0.0146016 -0.0562368 0.0013153 0.0471773 -0.1066781 -0.0337024 -0.1104007 -0.0425311 0.1068336 0.0268143 0.0422072 0.0086627 0.0798631 -0.0176708 -0.0039317 0.0270842 -0.0528297 0.0130836 0.110878 0.0073531 0.1003298 -0.054211 -0.0006565 -0.003471 -0.0250813 0.0677868 -0.0315215 -0.0176506 0.1109354 -0.0198287 0.0742024 -0.0128999 0.1032063 0.0147808 -0.0162103 0.0987392 0.0073854 0.0395861 -0.0355022 -0.040652 -0.0283154 -0.0010567 -0.0586842 0.0744602 0.2755197 0.0142933 0.0102087 0.08832 0.2583799 -0.0646002 0.115512 -0.0816623 0.2282782 -0.0101461 -0.0105405 0.0076729 0.0166768 0.0853475 0.0591392 0.1207437 0.0429686 0.0074524 0.007438 0.002756 -0.0213474 0.1002948 -0.0410204 0.025732 0.0428407 0.0131194 0.1140268 0.3139832 -0.0347813 -0.0702059 -0.0594483 0.331898 -0.1175022 -0.1055587 -0.11197 0.2208195 unknown
polarizability: 108.6173344|-4.394578|61.9261071|6.3210285|9.8059771|69.8209571 unknown
InChI: InChI=1S/C6H9NO3/c8-5(9)3-7-6(10)4-1-2-4/h4,7-8H,1-3H2
charge 0 multiplicity 1
19 atoms
O  -0.896408 -0.801168 -1.322812
O  3.946323 -0.425397 0.326278
O  2.615199 0.805617 1.784016
N  0.337828 0.184167 0.372744
C  -2.075576 0.552904 0.331326
C  -3.197983 0.996327 -0.636619
C  -3.402041 -0.23666 0.231562
C  -0.856853 -0.07496 -0.277212
C  1.591876 -0.369343 -0.12586
C  2.728526 0.078574 0.771095
H  -1.921083 1.159502 1.229974
H  -2.997465 0.829025 -1.698223
H  -3.737895 1.915038 -0.391834
H  -4.084161 -0.178591 1.084127
H  -3.337494 -1.209838 -0.262324
H  0.38536 0.765888 1.213992
H  1.792473 -0.047311 -1.166334
H  1.56286 -1.47603 -0.160235
H  4.679015 -0.120643 0.927237
