program: Orca
programVersion: 5.0.2
elementType: N H C H C O C C O N H C H H H O H H S H C O C H H C H H C H N H H C O O H H
charge: 1
multiplicity: 1
keywords: wB97X-D3BJ Opt Freq def2-TZVPP def2/J RIJCOSX VeryTightSCF
keywords: PAL8 defgrid3 TightOpt
frequency: 0.00 0.00 0.00 0.00 0.00 0.00 17.51 23.63 27.38 43.38 54.88 63.09 71.58 78.48 83.46 109.19 120.70 150.39 165.24 225.68 237.14 267.80 285.58 299.53 311.76 319.88 340.00 351.15 373.72 413.43 434.37 481.45 497.06 508.99 521.84 566.13 581.36 594.59 614.47 635.45 658.72 674.77 687.19 714.19 736.66 749.18 762.05 800.03 836.32 847.30 859.54 875.97 904.48 942.67 984.15 1025.08 1028.23 1057.88 1072.97 1080.22 1110.53 1130.46 1160.08 1167.30 1192.42 1199.44 1208.54 1210.03 1226.23 1258.70 1285.11 1304.58 1308.48 1319.54 1335.49 1358.70 1366.18 1371.18 1393.05 1397.87 1409.80 1436.99 1460.24 1462.20 1476.44 1477.38 1495.57 1572.26 1594.63 1598.19 1612.65 1683.11 1715.65 1779.25 1853.62 1880.66 2193.74 2758.44 3077.10 3095.67 3109.89 3119.90 3121.05 3124.93 3139.74 3153.32 3169.32 3175.38 3421.08 3552.26 3570.05 3638.60 3783.31 3799.20
frequency: 17.51 23.63 27.38 43.38 54.88 63.09 71.58 78.48 83.46 109.19 120.70 150.39 165.24 225.68 237.14 267.80 285.58 299.53 311.76 319.88 340.00 351.15 373.72 413.43 434.37 481.45 497.06 508.99 521.84 566.13 581.36 594.59 614.47 635.45 658.72 674.77 687.19 714.19 736.66 749.18 762.05 800.03 836.32 847.30 859.54 875.97 904.48 942.67 984.15 1025.08 1028.23 1057.88 1072.97 1080.22 1110.53 1130.46 1160.08 1167.30 1192.42 1199.44 1208.54 1210.03 1226.23 1258.70 1285.11 1304.58 1308.48 1319.54 1335.49 1358.70 1366.18 1371.18 1393.05 1397.87 1409.80 1436.99 1460.24 1462.20 1476.44 1477.38 1495.57 1572.26 1594.63 1598.19 1612.65 1683.11 1715.65 1779.25 1853.62 1880.66 2193.74 2758.44 3077.10 3095.67 3109.89 3119.90 3121.05 3124.93 3139.74 3153.32 3169.32 3175.38 3421.08 3552.26 3570.05 3638.60 3783.31 3799.20
formula: C10H18N3O6S
InChI: InChI=1S/C10H18N3O6S/c11-5(10(18)19)1-2-7(14)13-6(4-20)9(17)12-3-8(15)16/h5-6,12-13,15,18,20H,1-4H2,11H3
38 atoms
N  -3.096115 1.672408 0.778171
H  -2.816462 2.638091 0.711859
C  -4.490869 1.347703 0.973296
H  -4.583198 0.427223 1.547504
C  -5.299374 1.150193 -0.300476
O  -6.402587 0.689137 -0.308586
C  -2.240781 0.735049 0.334238
C  -0.834104 1.221925 -0.034245
O  -2.532545 -0.444186 0.209185
N  -0.016485 0.018839 -0.057856
H  -0.448731 1.906592 0.7224
C  -0.808004 1.914718 -1.407278
H  -0.556607 -0.83948 -0.083521
H  0.233788 2.067773 -1.686281
H  -1.270181 1.276326 -2.159636
O  -4.663546 1.576355 -1.416131
H  -5.266682 1.411577 -2.153718
H  -4.968795 2.145168 1.542766
S  -1.571129 3.553201 -1.433722
H  -2.819148 3.147898 -1.694387
C  1.303307 0.018755 0.00358
O  1.952143 1.082895 0.091941
C  1.993562 -1.330043 -0.063762
H  1.294898 -2.107801 0.245965
H  2.21487 -1.525926 -1.118124
C  3.263907 -1.436458 0.792989
H  3.47908 -2.492503 0.954441
H  3.093584 -0.99893 1.779507
C  4.537757 -0.825144 0.197869
H  5.385885 -1.093405 0.830797
N  4.465957 0.661871 0.099221
H  4.908182 0.949086 -0.779632
H  3.402669 0.948003 0.081221
C  4.850186 -1.331153 -1.207586
O  5.061718 -0.590305 -2.130867
O  4.866414 -2.657083 -1.261056
H  5.104785 -2.935229 -2.157587
H  4.926296 1.121073 0.879579
totalener: -1406.25582342 hartree
nucrepener: 1753.19279663 hartree
electener: -3159.44862005 hartree
oneelecener: -5391.14758356 hartree
twoeener: 2231.69896351 hartree
kineticenergy: 1400.65147882 hartree
exchangeener: -105.324251752807 hartree
correlationener: -7.052675403637 hartree
xcener: -112.376927156445 hartree
temp: 298.15 k
press: 1.00 atm
thermalcorrenthalpy: 0.00094421 hartree
totalenthalpy: -1406.00451102 hartree
totalentropycorr: -0.06604440 hartree
gibbsenthalpy: -1406.07055542 hartree
gibbsminuselec: 0.26163623 hartree
chargesum: 1.0000000
charge: -0.208557 0.179609 -0.074278 0.140634 0.298036 -0.276399 0.273337 0.057837 -0.388957 -0.150018 0.123360 -0.188320 0.192017 0.128353 0.129937 -0.293910 0.234699 0.131537 -0.159275 0.127576 0.288565 -0.427161 -0.167719 0.132591 0.117884 -0.204136 0.147311 0.134887 -0.016984 0.152545 -0.082951 0.216715 0.215183 0.279523 -0.290722 -0.248155 0.257987 0.217421
charge: 0.332310 -0.037554 -0.034854 0.045512 -0.430278 0.141226 -0.381548 -0.119519 0.090954 0.376233 0.034168 -0.239572 -0.015179 0.009200 0.011994 0.342774 -0.085250 0.040262 0.499960 -0.150330 -0.333223 0.155354 0.002488 0.041714 0.041070 0.003822 0.045157 0.036698 -0.058610 0.047058 0.588617 0.023319 -0.094283 -0.441003 0.141843 0.401773 -0.063233 0.030931
qa: -0.2086 0.1796 -0.0743 0.1406 0.2980 -0.2764 0.2733 0.0578 -0.3890 -0.1500 0.1234 -0.1883 0.1920 0.1284 0.1299 -0.2939 0.2347 0.1315 -0.1593 0.1276 0.2886 -0.4272 -0.1677 0.1326 0.1179 -0.2041 0.1473 0.1349 -0.0170 0.1525 -0.0830 0.2167 0.2152 0.2795 -0.2907 -0.2482 0.2580 0.2174
va: 3.2037 1.0451 3.8305 1.0192 4.2694 2.2370 4.2341 3.8014 2.1331 3.3272 1.0286 3.9612 1.0458 1.0106 1.0100 2.1357 1.0203 1.0005 2.1705 1.0305 4.1193 2.0871 3.8383 1.0064 1.0125 3.8855 1.0087 1.0039 3.9327 1.0012 3.5166 1.0166 1.1225 4.3455 2.1980 2.2650 1.0025 0.9845
dispcorr: -0.077284007 hartree
energy: -1406.338396868673
dipole: 11.75196 -6.31027 5.44169 -3.50558 2.58515 -0.92042 4.34162 -3.45707 0.88456
magnitude: 5.58942 au
magnitude: 14.20716 debye
zeropoint: 0.30979305 hartree
thermalvibcorrection: 0.01837842 hartree
thermalrotcorrection: 0.00141627 hartree
thermaltrasncorrection: 0.00141627 hartree
thermaltotal: -1406.00739286 hartree
thermalcorr: 0.02121096 hartree
nonthermalcorr: 0.30979305 hartree
totalcorr: 0.33100401 hartree
totalenthalpy: -1406.00644865 hartree
