program: Orca
programVersion: 5.0.2
elementType: N H C H C O C C O N H C H H H O H H S H C O C H H C H H C H N H H C O O H H
charge: 1
multiplicity: 1
keywords: wB97X-D3BJ Opt Freq def2-TZVPP def2/J RIJCOSX VeryTightSCF
keywords: PAL8 defgrid3 TightOpt
frequency: 0.00 0.00 0.00 0.00 0.00 0.00 18.83 28.38 36.47 46.44 52.96 61.98 64.74 87.86 122.27 134.92 154.86 171.64 196.25 205.84 215.21 222.94 254.24 280.72 285.96 292.10 322.04 350.16 378.06 386.75 415.13 437.92 476.54 489.42 500.02 509.37 540.63 575.72 579.89 609.30 638.71 650.20 662.22 728.66 741.29 753.59 772.08 819.06 839.32 856.96 862.20 877.21 904.80 934.45 969.94 993.83 1009.34 1049.23 1058.40 1094.73 1109.19 1111.48 1124.49 1158.34 1184.38 1207.56 1211.45 1231.41 1248.97 1276.84 1294.70 1296.79 1308.65 1324.11 1338.85 1354.13 1369.78 1376.29 1392.23 1400.02 1408.13 1428.28 1451.44 1469.02 1479.33 1494.20 1502.12 1525.71 1592.97 1603.09 1621.73 1674.85 1724.92 1751.07 1854.02 1885.06 2750.08 3083.28 3098.42 3099.05 3102.58 3102.65 3118.69 3153.46 3158.65 3167.70 3182.05 3188.60 3327.69 3507.06 3692.09 3700.97 3785.75 3786.55
frequency: 18.83 28.38 36.47 46.44 52.96 61.98 64.74 87.86 122.27 134.92 154.86 171.64 196.25 205.84 215.21 222.94 254.24 280.72 285.96 292.10 322.04 350.16 378.06 386.75 415.13 437.92 476.54 489.42 500.02 509.37 540.63 575.72 579.89 609.30 638.71 650.20 662.22 728.66 741.29 753.59 772.08 819.06 839.32 856.96 862.20 877.21 904.80 934.45 969.94 993.83 1009.34 1049.23 1058.40 1094.73 1109.19 1111.48 1124.49 1158.34 1184.38 1207.56 1211.45 1231.41 1248.97 1276.84 1294.70 1296.79 1308.65 1324.11 1338.85 1354.13 1369.78 1376.29 1392.23 1400.02 1408.13 1428.28 1451.44 1469.02 1479.33 1494.20 1502.12 1525.71 1592.97 1603.09 1621.73 1674.85 1724.92 1751.07 1854.02 1885.06 2750.08 3083.28 3098.42 3099.05 3102.58 3102.65 3118.69 3153.46 3158.65 3167.70 3182.05 3188.60 3327.69 3507.06 3692.09 3700.97 3785.75 3786.55
formula: C10H18N3O6S
InChI: InChI=1S/C10H18N3O6S/c11-5(10(18)19)1-2-7(14)13-6(4-20)9(17)12-3-8(15)16/h5-6,12-13,15,18,20H,1-4H2,11H3
38 atoms
N  -0.245035 3.249223 -1.612505
H  -0.534141 3.775915 -0.807549
C  0.134456 3.980668 -2.804589
H  0.076506 3.300567 -3.655427
C  1.535619 4.568489 -2.756835
O  1.809282 5.675958 -3.111622
C  -0.167821 1.914168 -1.530002
C  -0.709996 1.252064 -0.244286
O  0.245525 1.22032 -2.45752
N  0.021345 0.019109 -0.033988
H  -1.736913 0.966499 -0.487755
C  -0.736429 2.139008 1.006246
H  -0.482422 -0.849094 -0.033145
H  0.276106 2.454046 1.255961
H  -1.346399 3.027749 0.843702
O  2.466199 3.695245 -2.290885
H  3.297561 4.189877 -2.265299
H  -0.553785 4.806908 -2.969758
S  -1.374016 1.277256 2.460815
H  -2.671878 1.368517 2.146364
C  1.363696 0.00614 -0.028202
O  2.0167 1.050759 0.004019
C  2.029173 -1.338856 -0.211432
H  2.966158 -1.33857 0.346764
H  1.401582 -2.139777 0.182644
C  2.28537 -1.609677 -1.705875
H  1.354189 -1.517251 -2.272338
H  2.62646 -2.63836 -1.815776
C  3.355826 -0.724516 -2.349315
H  4.26351 -0.743185 -1.739622
N  2.940256 0.70134 -2.477272
H  1.940119 0.804267 -2.737159
H  2.99535 1.173815 -1.563883
C  3.756028 -1.169815 -3.754758
O  3.849993 -0.397082 -4.670832
O  4.015807 -2.47054 -3.814156
H  4.302414 -2.691405 -4.712236
H  3.499814 1.161183 -3.196079
totalener: -1406.25105467 hartree
nucrepener: 1872.33482929 hartree
electener: -3278.58588396 hartree
oneelecener: -5628.27187512 hartree
twoeener: 2349.68599117 hartree
kineticenergy: 1400.67419719 hartree
exchangeener: -105.329933299441 hartree
correlationener: -7.054006762931 hartree
xcener: -112.383940062372 hartree
temp: 298.15 k
press: 1.00 atm
thermalcorrenthalpy: 0.00094421 hartree
totalenthalpy: -1406.00165764 hartree
totalentropycorr: -0.06561749 hartree
gibbsenthalpy: -1406.06727513 hartree
gibbsminuselec: 0.26408799 hartree
chargesum: 1.0000000
charge: -0.166441 0.185323 -0.086031 0.131529 0.268364 -0.252366 0.295835 0.049179 -0.460870 -0.140087 0.128480 -0.208895 0.187470 0.158700 0.114069 -0.303610 0.236904 0.159903 -0.124545 0.102793 0.230733 -0.427697 -0.165873 0.122690 0.117512 -0.193139 0.120058 0.142853 0.009774 0.137929 -0.044592 0.228790 0.226852 0.294311 -0.297747 -0.247736 0.254236 0.215344
charge: 0.352668 -0.019942 -0.023619 0.040511 -0.428838 0.154844 -0.354736 -0.131148 0.083896 0.359290 0.044427 -0.251202 -0.013302 0.013316 0.000205 0.332988 -0.086977 0.041721 0.500455 -0.147982 -0.372893 0.084104 0.001537 0.039819 0.035771 0.002838 0.034659 0.041685 -0.050623 0.048974 0.604850 -0.004797 0.000620 -0.432177 0.135167 0.397444 -0.064458 0.030905
qa: -0.1664 0.1853 -0.0860 0.1315 0.2684 -0.2524 0.2958 0.0492 -0.4609 -0.1401 0.1285 -0.2089 0.1875 0.1587 0.1141 -0.3036 0.2369 0.1599 -0.1245 0.1028 0.2307 -0.4277 -0.1659 0.1227 0.1175 -0.1931 0.1201 0.1429 0.0098 0.1379 -0.0446 0.2288 0.2269 0.2943 -0.2977 -0.2477 0.2542 0.2153
va: 3.2323 1.0131 3.7991 1.0197 4.3009 2.2467 4.1860 3.8593 2.0419 3.1903 0.9994 3.9196 1.0115 1.0064 1.0102 2.1232 1.0167 1.0028 2.1580 1.0230 4.2058 2.0645 3.8446 1.0239 1.0117 3.8447 1.0225 1.0205 3.8479 1.0090 3.5993 1.0587 1.0346 4.3579 2.1923 2.2600 1.0060 1.0116
dispcorr: -0.080634063 hartree
energy: -1406.336769389936
dipole: -1.43699 1.74579 0.30880 -5.54069 3.69959 -1.84111 1.66062 -2.00114 -0.34052
magnitude: 1.89763 au
magnitude: 4.82338 debye
zeropoint: 0.31099872 hartree
thermalvibcorrection: 0.01860360 hartree
thermalrotcorrection: 0.00141627 hartree
thermaltrasncorrection: 0.00141627 hartree
thermaltotal: -1406.00433453 hartree
thermalcorr: 0.02143614 hartree
nonthermalcorr: 0.31099872 hartree
totalcorr: 0.33243486 hartree
totalenthalpy: -1406.00339032 hartree
