program: Gaussian 09
title: 000048674
version: EM64L-G09RevD.01
frameworkgroup: C1[X(C16H28N3O2)]
method: RPBEPBE
basis: SDD
operation: Freq
keyword: #p
keyword: freq=noraman
keyword: PBEPBE/SDD
title: #p freq=noraman PBEPBE/SDD
converged: YES YES NO NO
title: Mulliken charges:
elementType: O O N N N C C C C C C C C C C C C C C C C H H H H H H H H H H H H H H H H H H H H H H H H H H H H
charge: -0.358769 -0.285227 -0.122760 -0.169081 -0.116365 -0.396986 -0.563404 -0.552643 -0.566929 0.001713 -0.112296 0.101932 0.269065 0.283459 -0.695787 -0.705818 -0.658471 -0.659394 -0.276439 -0.357577 -0.131738 0.326063 0.263595 0.253793 0.244012 0.329756 0.262452 0.263894 0.271659 0.257550 0.310371 0.249603 0.213084 0.261833 0.228003 0.257164 0.228873 0.221389 0.234689 0.243319 0.233835 0.218929 0.227355 0.217344 0.236206 0.218682 0.277617 0.264521 0.257922
chargesum: 1.00000
title: Mulliken charges with hydrogens summed into heavy atoms:
elementType: O O N N N C C C C C C C C C C C C C C C C
charge: -0.358769 -0.285227 -0.122760 -0.169081 -0.116365 0.192671 0.264156 0.245362 0.250595 0.214797 0.149538 0.101932 0.269065 0.283459 0.018253 -0.006420 0.021648 0.012838 0.001178 -0.093056 0.126184
polarizability: 2.37734145e+02 -8.12427526e+00 2.09926893e+02 1.14054547e+01 -8.69320577e-01 1.52000428e+02
1716.lowfreq: -18.7162 -12.7248 -0.0002 0.0004 0.0006 4.0790 14.3464 15.4098 33.9675
frequency: -7.7110 13.9523 32.8931 48.1940 63.5228 70.3723 88.7018 114.3878 124.0632 153.2710 161.0515 176.7978 192.1136 199.7234 215.5307 217.6276 227.5421 232.2812 237.3825 251.6382 266.6298 275.2983 296.0457 304.5703 326.7856 332.1842 346.8244 383.8712 405.9490 408.8461 428.9279 450.0956 473.0500 489.9535 508.7092 511.4008 528.4748 581.2786 609.7367 613.6125 679.6032 701.2771 729.7339 750.2456 776.4946 828.4385 830.4039 864.9070 878.4295 897.7847 907.6145 917.7398 921.3679 922.3739 937.7357 942.1449 942.5167 945.8871 978.8995 993.7275 1015.1562 1049.5434 1055.9575 1074.0648 1106.5081 1112.5164 1117.6117 1131.9974 1150.2793 1151.2887 1161.7552 1166.7628 1187.3909 1197.9168 1218.7671 1229.8713 1255.5325 1269.1860 1279.9917 1299.2502 1309.0451 1314.5465 1325.2801 1363.3026 1373.9682 1376.6222 1384.2678 1389.3489 1399.7540 1402.3040 1407.0225 1417.9304 1427.8282 1430.9712 1443.9665 1445.6862 1452.2827 1458.4519 1462.4143 1469.1933 1471.0215 1474.8038 1475.5255 1477.8121 1478.5186 1479.5331 1484.2305 1489.9803 1496.0412 1511.2047 1559.5081 1579.0872 1679.0867 2986.6841 2989.8677 2991.7478 2997.3802 3013.6255 3018.1890 3021.3002 3024.6104 3035.8164 3070.6876 3081.0056 3081.8863 3085.7614 3090.6504 3091.8237 3095.7181 3102.6224 3103.5600 3113.3245 3134.9750 3138.0695 3140.9089 3142.3028 3144.3442 3156.1328 3156.7862 3169.2128 3187.5831
redmass: 3.0051 3.2638 3.1114 3.4847 3.7074 2.7076 3.6072 4.9559 4.4442 2.6592 2.9109 3.1369 1.0959 1.2910 1.2728 1.1922 2.0749 3.1823 1.2049 1.8406 1.3090 1.2633 2.0960 4.0517 2.8786 2.8327 2.1891 2.5611 3.7219 2.8312 2.1921 3.7881 3.2642 3.0435 3.8241 3.5846 3.8861 3.0312 5.5667 5.6989 10.3903 7.7129 3.2661 3.4183 4.5046 1.6771 3.5125 3.0611 3.1642 2.8724 3.0305 1.2218 1.5426 2.1664 1.3737 1.5046 2.3259 1.4253 1.7461 1.3921 2.0942 1.2016 2.2663 2.4428 1.3274 1.4810 1.7917 2.3822 2.3778 2.3022 1.6951 1.6894 1.4758 2.2968 1.9356 2.3488 1.8966 2.3531 2.2866 1.4774 1.3815 5.6378 1.3510 1.2379 1.5498 1.2147 1.2053 1.3116 1.2607 1.1307 1.3345 1.1850 2.0367 2.0065 1.0821 1.2147 1.1406 1.0454 1.0454 1.0488 1.0533 1.0453 1.0453 1.0658 1.0580 1.0497 1.0566 1.0586 1.0550 1.0510 6.3423 6.6664 9.7519 1.0358 1.0366 1.0355 1.0363 1.0317 1.0565 1.0323 1.0349 1.0850 1.0916 1.0998 1.1043 1.1000 1.1004 1.0994 1.0997 1.0967 1.0965 1.0998 1.1053 1.1057 1.1051 1.1064 1.1049 1.0895 1.1050 1.0927 1.1010
irintensity: 0.5955 1.5492 0.2441 0.9208 0.2672 0.2689 2.0844 3.7731 1.5728 2.9017 0.6013 1.6058 0.0492 0.9534 1.6345 0.8088 12.1566 10.0893 0.2040 2.6404 3.5088 0.3598 3.8166 3.4231 0.3832 3.8249 0.7270 3.1043 2.1272 3.2779 0.3361 1.7080 4.6335 7.3596 2.5552 3.0194 0.7871 20.2869 9.1632 5.8404 20.4314 25.2185 4.7801 3.1274 5.4251 64.4953 29.4369 22.0631 93.1091 24.5233 77.1467 5.2767 41.5623 78.5307 0.1212 5.4441 16.0734 0.1017 0.8266 0.6824 118.7306 0.7033 10.6591 62.5653 0.0573 35.0357 27.7643 1.0119 34.0271 49.2554 55.5595 28.5574 22.7766 50.3818 114.5288 121.7722 20.1107 46.5239 94.7504 52.7873 1.6789 7.8787 1.9270 5.7507 20.9359 18.3776 36.0224 33.6859 3.0842 28.0689 38.0084 25.7750 53.0015 39.7230 1.8468 20.0469 15.2246 0.1387 1.7656 5.2950 14.2981 11.2993 30.5291 14.1376 37.7170 6.6332 11.9096 31.2498 18.0550 77.9354 4.7689 10.1701 418.5076 16.5737 11.7797 24.8732 13.2756 29.5658 2.7468 3.2428 22.5738 11.4253 14.8739 4.0440 3.6586 10.3721 22.5767 42.0022 34.0730 14.7563 25.8937 26.4089 0.9799 2.1540 10.4187 9.1013 13.7690 2.1689 2.9248 6.2885 4.0874
temp: 298.150 k
press: 1.00000 atm
elementType: 8 8 7 7 7 6 6 6 6 6 6 6 6 6 6 6 6 6 6 6 6 1 1 1 1 1 1 1 1 1 1 1 1 1 1 1 1 1 1 1 1 1 1 1 1 1 1 1 1
symmnumber: 1
zpe: 1112641.2 jmol-1
zpe.correction: 0.423783 hartree
zpe.thermalcorrener: 0.446947 hartree
zpe.thermalcorrenthalpy: 0.447891 hartree
zpe.thermalcorrgfe: 0.371549 hartree
zpe.sumelectzpe: -939.324064 hartree
zpe.sumelectthermal: -939.300900 hartree
zpe.sumelectthermalent: -939.299956 hartree
zpe.sumelectthermalfe: -939.376298 hartree
dipole: -6.8226 -3.3987 2.9966
dipole: 8.1902
quadrupole: -60.0784 -89.6659 -121.7580
quadrupole: 14.3297 -2.1425 -3.7044
quadrupole: 30.4224 0.8349 -31.2573 14.3297 -2.1425 -3.7044
hfenergy: -939.7478471 hartree
pointgroup: C01 [X(C16H28N3O2)]
dipole: -2.3960529 -2.1542371 -0.0348304 debye
polarizability: 240.5693256|-5.9737773|182.6819332|-0.0321207|28.691617|176.4102083 unknown
InChI: InChI=1S/C16H28N3O2/c1-12(2)18(13(3)4)16(20)21-15-9-8-10-17-14(15)11-19(5,6)7/h8-10,12-13H,11H2,1-7H3
charge 1 multiplicity 1
49 atoms
O  0.564782 0.223823 1.172361
O  0.717837 0.462188 -1.177434
N  -2.718096 -2.065189 -0.713006
N  2.646582 0.05728 0.124246
N  -3.108104 0.550474 0.567415
C  -1.539233 -1.109871 -0.42555
C  -3.736021 -1.400511 -1.648746
C  -2.138265 -3.292857 -1.4150
C  -3.415743 -2.512865 0.571205
C  3.572196 0.052786 -1.071602
C  3.250375 -0.123326 1.493758
C  -1.828998 0.082105 0.475168
C  -0.762069 0.7105 1.174636
C  1.321959 0.268467 -0.088713
C  3.590585 1.420792 -1.788995
C  3.259129 -1.118103 -2.029525
C  4.211927 1.038383 1.831842
C  3.93137 -1.504872 1.621437
C  -1.038053 1.829941 1.989648
C  -3.369704 1.632798 1.353246
C  -2.362828 2.302057 2.083364
H  -1.163785 -0.753182 -1.400726
H  -0.738839 -1.723275 0.025951
H  -3.228513 -1.142645 -2.591249
H  -4.551372 -2.115618 -1.840209
H  -4.101876 -0.494634 -1.145246
H  -1.47786 -3.832047 -0.718557
H  -2.964997 -3.948156 -1.728821
H  -1.56618 -2.966173 -2.296834
H  -2.66253 -2.915822 1.266048
H  -3.918456 -1.642935 1.013862
H  -4.148569 -3.293753 0.314924
H  4.573575 -0.119659 -0.639154
H  2.407215 -0.089297 2.199687
H  4.353469 1.405477 -2.587622
H  2.613467 1.64241 -2.247855
H  3.847346 2.234295 -1.088121
H  3.287481 -2.086632 -1.498771
H  4.01651 -1.148022 -2.832776
H  2.269347 -0.988496 -2.497786
H  4.579983 0.91963 2.866268
H  5.095161 1.057894 1.168211
H  3.700544 2.014153 1.758857
H  3.224781 -2.32257 1.394229
H  4.290272 -1.639973 2.656986
H  4.807123 -1.604409 0.954973
H  -0.217027 2.308279 2.531418
H  -4.412644 1.961509 1.391214
H  -2.611156 3.168553 2.702146
