program: Orca
programVersion: 5.0.2
elementType: N H C H C O C C O N H C H H H O H H S H C O C H H C H H C H N H H C O O H H
charge: 1
multiplicity: 1
keywords: wB97X-D3BJ Opt Freq def2-TZVPP def2/J RIJCOSX VeryTightSCF
keywords: PAL8 defgrid3 TightOpt
frequency: 0.00 0.00 0.00 0.00 0.00 0.00 27.85 41.10 45.28 67.47 69.85 88.61 94.02 108.79 116.57 126.49 147.93 161.91 172.34 199.55 224.62 234.23 265.27 269.43 289.96 294.81 310.26 359.81 385.58 404.95 436.67 454.46 474.16 500.12 505.96 527.28 539.46 579.59 613.21 626.41 649.18 666.98 730.28 745.04 747.44 773.80 793.29 808.10 840.13 861.29 878.34 916.76 930.47 943.48 973.79 988.91 1009.83 1028.38 1050.24 1067.11 1099.24 1118.30 1144.26 1160.43 1183.00 1209.35 1212.25 1242.70 1246.59 1264.10 1281.27 1302.45 1311.19 1324.40 1337.70 1360.71 1375.83 1382.51 1391.03 1418.46 1433.10 1437.66 1448.79 1484.88 1489.18 1494.55 1494.93 1539.31 1562.43 1579.90 1644.84 1694.03 1735.69 1775.14 1815.29 1865.07 2772.87 3081.96 3087.34 3102.42 3108.87 3124.61 3131.53 3134.54 3139.17 3150.19 3157.69 3194.13 3197.47 3543.72 3561.28 3673.93 3683.64 3788.97
frequency: 27.85 41.10 45.28 67.47 69.85 88.61 94.02 108.79 116.57 126.49 147.93 161.91 172.34 199.55 224.62 234.23 265.27 269.43 289.96 294.81 310.26 359.81 385.58 404.95 436.67 454.46 474.16 500.12 505.96 527.28 539.46 579.59 613.21 626.41 649.18 666.98 730.28 745.04 747.44 773.80 793.29 808.10 840.13 861.29 878.34 916.76 930.47 943.48 973.79 988.91 1009.83 1028.38 1050.24 1067.11 1099.24 1118.30 1144.26 1160.43 1183.00 1209.35 1212.25 1242.70 1246.59 1264.10 1281.27 1302.45 1311.19 1324.40 1337.70 1360.71 1375.83 1382.51 1391.03 1418.46 1433.10 1437.66 1448.79 1484.88 1489.18 1494.55 1494.93 1539.31 1562.43 1579.90 1644.84 1694.03 1735.69 1775.14 1815.29 1865.07 2772.87 3081.96 3087.34 3102.42 3108.87 3124.61 3131.53 3134.54 3139.17 3150.19 3157.69 3194.13 3197.47 3543.72 3561.28 3673.93 3683.64 3788.97
formula: C10H18N3O6S
InChI: InChI=1S/C10H18N3O6S/c11-5(10(18)19)1-2-7(14)13-6(4-20)9(17)12-3-8(15)16/h5-6,12-13,15,18,20H,1-4H2,11H3
38 atoms
N  -0.142632 1.60307 -2.285107
H  -0.271482 0.60932 -2.362146
C  0.561006 2.285044 -3.360399
H  0.415908 1.741427 -4.289947
C  2.044657 2.278547 -3.008593
O  2.807185 1.423302 -3.410903
C  -0.246045 2.182197 -1.062583
C  -0.725992 1.248746 0.060481
O  0.025507 3.355073 -0.873921
N  0.04075 -0.001048 -0.000603
H  -1.764653 0.977605 -0.142427
C  -0.647177 1.938627 1.417157
H  -0.445345 -0.871946 0.131257
H  0.350494 2.337656 1.578697
H  -1.357817 2.761918 1.428214
O  2.458354 3.199259 -2.150104
H  1.691463 3.648681 -1.741218
H  0.179366 3.300407 -3.463719
S  -1.078831 0.718823 2.690494
H  -1.472025 1.589574 3.624176
C  1.387939 0.012643 0.007259
O  1.998982 1.081951 0.012755
C  2.113229 -1.313396 -0.051374
H  2.597647 -1.462794 0.917754
H  1.401743 -2.130491 -0.178235
C  3.153594 -1.389005 -1.185019
H  2.720063 -1.057199 -2.132855
H  3.416849 -2.43827 -1.312074
C  4.472616 -0.642212 -0.947366
H  4.791102 -0.781592 0.089422
N  4.349945 0.820854 -1.184449
H  4.025551 1.026683 -2.151643
H  3.602031 1.186545 -0.560321
C  5.616896 -1.128637 -1.834545
O  6.301247 -0.37957 -2.474576
O  5.769526 -2.449679 -1.767648
H  6.527205 -2.701799 -2.314875
H  5.241846 1.292772 -1.051411
totalener: -1406.25416109 hartree
nucrepener: 1907.02120904 hartree
electener: -3313.27537013 hartree
oneelecener: -5697.43321391 hartree
twoeener: 2384.15784378 hartree
kineticenergy: 1400.67311393 hartree
exchangeener: -105.331598164533 hartree
correlationener: -7.058686826345 hartree
xcener: -112.390284990878 hartree
temp: 298.15 k
press: 1.00 atm
thermalcorrenthalpy: 0.00094421 hartree
totalenthalpy: -1406.00767570 hartree
totalentropycorr: -0.06466273 hartree
gibbsenthalpy: -1406.07233843 hartree
gibbsminuselec: 0.26453778 hartree
chargesum: 1.0000000
charge: -0.180975 0.177754 -0.123019 0.141133 0.329558 -0.363239 0.245731 0.061750 -0.379986 -0.246055 0.155706 -0.168403 0.205047 0.127528 0.138783 -0.248493 0.257153 0.155915 -0.170482 0.125988 0.320924 -0.445295 -0.168668 0.126307 0.109075 -0.219010 0.111918 0.151713 0.028204 0.137483 -0.071694 0.227458 0.223293 0.282344 -0.278544 -0.255275 0.254024 0.224350
charge: 0.332676 -0.025440 -0.029908 0.039082 -0.427428 0.122340 -0.368449 -0.132059 0.118848 0.341430 0.043581 -0.223873 -0.015651 0.005605 0.015978 0.389225 -0.106897 0.037094 0.462235 -0.141165 -0.358889 0.132355 0.000913 0.043746 0.034337 0.006879 0.033262 0.041606 -0.055498 0.047037 0.604612 -0.003172 -0.033088 -0.436600 0.141378 0.389126 -0.066422 0.041194
qa: -0.1810 0.1778 -0.1230 0.1411 0.3296 -0.3632 0.2457 0.0618 -0.3800 -0.2461 0.1557 -0.1684 0.2050 0.1275 0.1388 -0.2485 0.2572 0.1559 -0.1705 0.1260 0.3209 -0.4453 -0.1687 0.1263 0.1091 -0.2190 0.1119 0.1517 0.0282 0.1375 -0.0717 0.2275 0.2233 0.2823 -0.2785 -0.2553 0.2540 0.2244
va: 3.1866 1.0272 3.8962 1.0088 4.1510 2.1355 4.2288 3.7817 2.1356 3.1876 1.0010 4.0566 0.9983 1.0140 1.0075 2.2282 1.0367 1.0017 2.1652 1.0196 4.0925 2.0602 3.8331 1.0110 1.0175 3.8854 1.0234 1.0171 3.8085 1.0069 3.6117 1.0720 1.0613 4.3909 2.2170 2.2413 1.0052 0.9875
dispcorr: -0.082840205 hartree
energy: -1406.342659372538
dipole: -1.85039 2.17623 0.32584 -4.18119 2.36276 -1.81843 1.34844 -1.51908 -0.17064
magnitude: 1.85525 au
magnitude: 4.71568 debye
zeropoint: 0.31133842 hartree
thermalvibcorrection: 0.01818792 hartree
thermalrotcorrection: 0.00141627 hartree
thermaltrasncorrection: 0.00141627 hartree
thermaltotal: -1406.01030049 hartree
thermalcorr: 0.02102046 hartree
nonthermalcorr: 0.31133842 hartree
totalcorr: 0.33235888 hartree
totalenthalpy: -1406.00935628 hartree
