program: Gaussian 09
title: 000047420
version: EM64L-G09RevD.01
frameworkgroup: C1[X(C18H14O3)]
method: RPBEPBE
basis: SDD
operation: Freq
keyword: #pfreq=noraman
keyword: PBEPBE/SDD
title: #p freq=noraman PBEPBE/SDD
converged: YES YES NO YES
title: Mulliken charges:
elementType: O O O C C C C C C C C C C C C C C C C C C H H H H H H H H H H H H H H
charge: -0.314927 -0.428272 -0.428353 -0.141629 -0.314394 -0.167539 0.483218 -0.355755 0.300423 -0.709174 -0.620865 0.225890 0.453432 0.201205 -0.489785 0.422817 -0.474197 -0.363101 -0.430208 -0.259247 -0.245327 0.259241 0.247164 0.275307 0.264207 0.249759 0.236688 0.346457 0.361720 0.242539 0.238366 0.228453 0.241947 0.231588 0.232349
chargesum: 0.00000
title: Mulliken charges with hydrogens summed into heavy atoms:
elementType: O O O C C C C C C C C C C C C C C C C C C
charge: -0.314927 -0.081814 -0.066633 0.117612 -0.067230 0.107768 0.483218 -0.091548 0.300423 -0.459415 -0.384178 0.225890 0.453432 0.201205 -0.247246 0.422817 -0.235831 -0.134648 -0.188261 -0.027659 -0.012977
polarizability: 3.45925590e+02 1.23495644e+01 2.08531778e+02 -5.31895170e+00 3.11192687e+00 1.03057401e+02
1716.lowfreq: -0.0004 0.0001 0.0006 5.8529 8.2288 12.5954 45.6138 54.9684 99.9958
frequency: 45.4566 54.9638 99.9945 133.3839 139.4763 157.0932 220.4115 228.4362 239.4372 265.7450 282.2420 309.2793 338.2453 358.1126 388.2754 403.1130 428.5733 448.8177 469.5909 486.2153 517.2319 525.6101 536.0718 555.6433 575.4236 611.3121 624.9658 629.7200 665.0277 699.0274 716.5370 732.3484 756.1136 760.6136 764.4119 807.0036 810.0967 833.7844 852.5657 870.8695 886.4527 887.7665 911.4676 921.9383 950.7439 961.0592 968.3400 974.8360 985.5266 995.7808 1006.0779 1039.9706 1054.9538 1080.1339 1108.3873 1155.9787 1171.4636 1179.7480 1182.7926 1206.2601 1212.6993 1227.2054 1233.6454 1241.7406 1263.4032 1270.2239 1286.5753 1303.2305 1320.8936 1346.6050 1362.7734 1364.3675 1387.8747 1400.3396 1405.8116 1413.6207 1437.3532 1449.4012 1471.8352 1505.8424 1523.3225 1572.8687 1611.0764 1628.2861 1633.5036 3064.1668 3084.9274 3116.5788 3119.8371 3121.8333 3124.9174 3134.0691 3135.3554 3143.1654 3146.4596 3153.9856 3167.8012 3397.0745 3526.1819
redmass: 6.1142 5.2155 5.1279 5.9733 5.1577 5.0137 5.5732 5.8505 4.8169 4.7316 5.1322 4.4658 1.6512 2.3814 6.5093 3.8718 3.2813 4.2429 5.3531 6.1929 4.0972 5.6998 4.0121 4.2480 3.9175 1.8167 2.0866 4.9926 6.7602 3.8216 5.6212 4.5637 4.9761 1.3281 3.4893 2.1053 4.7187 1.5000 4.3601 4.6158 2.9287 1.6775 1.6767 1.8805 4.2794 1.3933 4.5625 5.5076 1.3911 1.3701 1.8992 2.1413 1.3395 1.8189 1.9808 1.4869 1.7918 1.0996 1.3593 1.2342 1.3318 1.9156 1.9754 1.6791 1.5253 1.8719 1.5949 1.9037 1.8993 1.3640 2.2499 1.6505 1.2505 3.4997 3.0500 2.7711 3.1386 3.4968 3.4244 3.7327 4.1255 7.6501 6.0384 6.6511 7.1215 1.0863 1.0869 1.0911 1.0882 1.0864 1.0865 1.0953 1.0888 1.0917 1.0982 1.0928 1.0997 1.0655 1.0660
irintensity: 0.9069 0.3163 0.6113 1.6911 0.2989 1.4767 6.2607 3.3750 0.4393 0.3059 7.5869 2.9397 57.3164 72.3378 2.0663 6.4894 7.1191 10.8655 4.0268 0.7530 2.2413 1.7133 5.2650 2.0282 8.0771 50.3981 94.6407 18.2254 32.0294 3.1128 0.3510 11.4461 8.9118 43.9157 10.2622 0.0494 20.5020 49.7204 24.7445 18.0633 37.9673 1.3521 46.1159 9.8187 38.8652 5.6934 11.3008 73.5382 0.0420 0.2008 13.4343 5.4015 4.1222 2.1938 7.1852 3.6158 11.5416 4.1765 36.8241 2.8442 29.2882 44.0163 3.2907 6.2610 8.8549 6.0509 2.2569 2.1174 11.2680 35.5908 9.5839 19.9200 65.8846 8.9148 6.5806 5.8352 5.1961 0.3820 1.8305 5.8597 5.3600 0.3904 3.3521 0.3078 0.5089 16.1322 16.3523 6.1464 7.5317 2.4551 3.4200 44.1444 4.8714 1.9398 29.9935 29.9407 30.8439 51.8888 5.1614
temp: 298.150 k
press: 1.00000 atm
elementType: 8 8 8 6 6 6 6 6 6 6 6 6 6 6 6 6 6 6 6 6 6 1 1 1 1 1 1 1 1 1 1 1 1 1 1
symmnumber: 1
zpe: 713463.4 jmol-1
zpe.correction: 0.271744 hartree
zpe.thermalcorrener: 0.287595 hartree
zpe.thermalcorrenthalpy: 0.288539 hartree
zpe.thermalcorrgfe: 0.229169 hartree
zpe.sumelectzpe: -918.513200 hartree
zpe.sumelectthermal: -918.497349 hartree
zpe.sumelectthermalent: -918.496405 hartree
zpe.sumelectthermalfe: -918.555775 hartree
dipole: -2.9686 2.7184 1.9665
dipole: 4.4799
quadrupole: -112.8793 -110.7487 -134.2849
quadrupole: 8.8080 3.9984 1.2775
quadrupole: 6.4250 8.5556 -14.9806 8.8080 3.9984 1.2775
hfenergy: -918.784944 hartree
pointgroup: C01 [X(C18H14O3)]
dipole: -1.1493342 -1.073671 -0.7954829 debye
polarizability: 346.0803792|-10.9102538|208.188763|7.1946937|4.2646603|103.2456269 unknown
InChI: InChI=1S/C18H14O3/c19-15-13-8-12-10(6-5-9-3-1-2-4-11(9)12)7-14(13)17-18(21-17)16(15)20/h1-8,15-20H
charge 0 multiplicity 1
35 atoms
O  4.101689 -0.802391 1.178409
O  3.60893 1.18687 -2.031476
O  2.98898 1.706882 1.662172
C  4.278717 -0.35664 -0.262306
C  3.201345 -1.357848 0.050182
C  3.844751 1.07457 -0.579688
C  1.780884 -0.92252 0.055462
C  2.602993 1.493608 0.254304
C  1.4704 0.480177 0.11877
C  0.739502 -1.856663 -0.02212
C  0.132062 0.889204 0.088445
C  -0.948836 -0.040951 0.013888
C  -0.626667 -1.447588 -0.043403
C  -2.354563 0.371377 -0.008113
C  -1.686943 -2.426876 -0.123477
C  -3.381231 -0.640174 -0.090635
C  -3.01164 -2.037224 -0.146832
C  -2.7627 1.739765 0.050497
C  -4.756951 -0.253827 -0.114719
C  -4.117626 2.09749 0.025779
C  -5.126212 1.09495 -0.058283
H  5.212496 -0.696118 -0.725214
H  3.394556 -2.420625 -0.135077
H  4.65919 1.787519 -0.375586
H  2.271534 2.485874 -0.094013
H  0.969037 -2.928992 -0.068571
H  -0.072451 1.963642 0.135998
H  2.812294 0.64234 -2.267437
H  3.364666 0.835396 1.980546
H  -1.417019 -3.488493 -0.164465
H  -3.810899 -2.785062 -0.207803
H  -2.013153 2.533734 0.119711
H  -5.52344 -1.03532 -0.177466
H  -4.402876 3.153971 0.0732
H  -6.183021 1.381943 -0.076678
