program: Orca
programVersion: 5.0.2
elementType: N H C H C O C C O N H C H H H O H H S H C O C H H C H H C H N H H C O O H H
charge: 1
multiplicity: 1
keywords: wB97X-D3BJ Opt Freq def2-TZVPP def2/J RIJCOSX VeryTightSCF
keywords: PAL8 defgrid3 TightOpt
frequency: 0.00 0.00 0.00 0.00 0.00 0.00 32.19 35.82 44.08 52.70 61.81 75.07 89.91 120.81 125.14 127.88 140.48 149.56 175.27 204.09 219.13 221.25 244.35 250.97 267.76 279.08 302.40 340.77 367.68 372.52 406.39 427.62 484.20 510.28 513.17 520.42 534.80 547.95 588.87 625.77 630.49 653.21 662.39 698.47 721.30 740.98 781.41 790.34 804.57 846.21 872.90 901.82 934.76 941.32 970.35 982.07 1000.86 1049.99 1053.40 1099.99 1113.57 1132.19 1136.09 1158.78 1187.98 1196.90 1214.61 1233.19 1249.96 1262.62 1286.80 1289.02 1303.28 1329.06 1336.23 1346.79 1355.57 1394.58 1398.01 1416.48 1424.30 1450.99 1462.64 1468.14 1482.01 1486.78 1497.63 1557.31 1564.65 1604.47 1639.68 1668.51 1709.42 1772.89 1842.86 1844.86 2765.40 3044.13 3074.55 3087.29 3093.41 3099.85 3106.13 3122.90 3159.50 3169.01 3169.14 3169.95 3429.69 3539.85 3688.27 3693.85 3790.45 3802.05
frequency: 32.19 35.82 44.08 52.70 61.81 75.07 89.91 120.81 125.14 127.88 140.48 149.56 175.27 204.09 219.13 221.25 244.35 250.97 267.76 279.08 302.40 340.77 367.68 372.52 406.39 427.62 484.20 510.28 513.17 520.42 534.80 547.95 588.87 625.77 630.49 653.21 662.39 698.47 721.30 740.98 781.41 790.34 804.57 846.21 872.90 901.82 934.76 941.32 970.35 982.07 1000.86 1049.99 1053.40 1099.99 1113.57 1132.19 1136.09 1158.78 1187.98 1196.90 1214.61 1233.19 1249.96 1262.62 1286.80 1289.02 1303.28 1329.06 1336.23 1346.79 1355.57 1394.58 1398.01 1416.48 1424.30 1450.99 1462.64 1468.14 1482.01 1486.78 1497.63 1557.31 1564.65 1604.47 1639.68 1668.51 1709.42 1772.89 1842.86 1844.86 2765.40 3044.13 3074.55 3087.29 3093.41 3099.85 3106.13 3122.90 3159.50 3169.01 3169.14 3169.95 3429.69 3539.85 3688.27 3693.85 3790.45 3802.05
formula: C10H18N3O6S
InChI: InChI=1S/C10H18N3O6S/c11-5(10(18)19)1-2-7(14)13-6(4-20)9(17)12-3-8(15)16/h5-6,12-13,15,18,20H,1-4H2,11H3
38 atoms
N  0.055075 2.976725 -1.995603
H  -0.044616 3.625252 -1.235119
C  0.446614 3.485683 -3.289406
H  -0.165479 3.025875 -4.069407
C  1.895808 3.217561 -3.662145
O  2.627234 2.414223 -3.140353
C  -0.101747 1.669406 -1.762875
C  -0.67965 1.224381 -0.404322
O  0.138753 0.821161 -2.625225
N  0.014041 0.00753 -0.018346
H  -1.711433 0.93703 -0.621145
C  -0.713613 2.287009 0.695038
H  -0.463753 -0.8627 -0.171246
H  0.287567 2.647166 0.922446
H  -1.327243 3.128931 0.366505
O  2.246859 3.979202 -4.698785
H  3.159427 3.773593 -4.943519
H  0.266145 4.5588 -3.324153
S  -1.526562 1.704442 2.197305
H  -0.539856 0.899674 2.604702
C  1.371834 0.011983 -0.019343
O  2.000794 1.057071 0.022773
C  2.058986 -1.334664 -0.160448
H  2.133176 -1.802085 0.824217
H  1.430616 -1.998055 -0.761707
C  3.46793 -1.213248 -0.756096
H  3.816264 -2.210705 -1.038001
H  4.157871 -0.840355 -0.000855
C  3.589651 -0.255078 -1.944047
H  3.474518 0.770716 -1.599457
N  2.536014 -0.457177 -2.987616
H  2.30158 -1.441279 -3.102939
H  1.66146 0.083915 -2.798961
C  4.919097 -0.350853 -2.674614
O  4.995874 -0.414288 -3.875536
O  5.950953 -0.325219 -1.84129
H  6.769833 -0.35102 -2.356702
H  2.933966 -0.136539 -3.876276
totalener: -1406.25252168 hartree
nucrepener: 1896.59017096 hartree
electener: -3302.84269264 hartree
oneelecener: -5677.65675863 hartree
twoeener: 2374.81406598 hartree
kineticenergy: 1400.68176255 hartree
exchangeener: -105.333410209597 hartree
correlationener: -7.055361411544 hartree
xcener: -112.388771621141 hartree
temp: 298.15 k
press: 1.00 atm
thermalcorrenthalpy: 0.00094421 hartree
totalenthalpy: -1406.00408599 hartree
totalentropycorr: -0.06573825 hartree
gibbsenthalpy: -1406.06982424 hartree
gibbsminuselec: 0.26375779 hartree
chargesum: 1.0000000
charge: -0.151304 0.190351 -0.088598 0.141911 0.320839 -0.363579 0.294712 0.086712 -0.460810 -0.188399 0.123073 -0.219215 0.181718 0.154059 0.114115 -0.241858 0.242094 0.149572 -0.126827 0.103341 0.204911 -0.365977 -0.196270 0.143761 0.105814 -0.195972 0.123659 0.134682 0.016406 0.176113 -0.067062 0.210994 0.235883 0.294238 -0.315044 -0.242322 0.250063 0.224218
charge: 0.357519 -0.014549 -0.029988 0.047016 -0.424906 0.099073 -0.345211 -0.136947 0.088606 0.334133 0.046711 -0.256262 -0.019751 0.003886 0.007343 0.388991 -0.077159 0.042282 0.498848 -0.149509 -0.386905 0.108257 -0.008767 0.045317 0.024089 0.001116 0.033419 0.046828 -0.058852 0.038263 0.612494 0.043272 -0.025705 -0.431948 0.125444 0.403035 -0.066768 0.037283
qa: -0.1513 0.1904 -0.0886 0.1419 0.3208 -0.3636 0.2947 0.0867 -0.4608 -0.1884 0.1231 -0.2192 0.1817 0.1541 0.1141 -0.2419 0.2421 0.1496 -0.1268 0.1033 0.2049 -0.3660 -0.1963 0.1438 0.1058 -0.1960 0.1237 0.1347 0.0164 0.1761 -0.0671 0.2110 0.2359 0.2942 -0.3150 -0.2423 0.2501 0.2242
va: 3.2282 1.0072 3.8201 1.0110 4.2647 2.1023 4.1410 3.8273 2.0467 3.1546 1.0139 3.9178 1.0147 1.0085 1.0055 2.2525 1.0159 1.0073 2.1699 1.0281 4.2095 2.1280 3.8388 1.0068 1.0138 3.8965 1.0054 1.0191 3.7213 1.0359 3.6285 0.9904 1.0853 4.3830 2.1799 2.2633 1.0087 1.0131
dispcorr: -0.081711368 hartree
energy: -1406.339201683992
dipole: -0.70177 1.33387 0.63210 -5.09604 4.03092 -1.06512 0.88028 -2.13895 -1.25867
magnitude: 1.76587 au
magnitude: 4.48847 debye
zeropoint: 0.31079049 hartree
thermalvibcorrection: 0.01864328 hartree
thermalrotcorrection: 0.00141627 hartree
thermaltrasncorrection: 0.00141627 hartree
thermaltotal: -1406.00693537 hartree
thermalcorr: 0.02147582 hartree
nonthermalcorr: 0.31079049 hartree
totalcorr: 0.33226631 hartree
totalenthalpy: -1406.00599116 hartree
