program: Orca
programVersion: 5.0.2
elementType: N H C H C O C C O N H C H H H O H H S H C O C H H C H H C H N H H C O O H H
charge: 1
multiplicity: 1
keywords: wB97X-D3BJ Opt Freq def2-TZVPP def2/J RIJCOSX VeryTightSCF
keywords: PAL8 defgrid3 TightOpt
frequency: 0.00 0.00 0.00 0.00 0.00 0.00 21.18 31.97 35.83 42.34 59.14 72.18 84.82 96.32 107.06 112.73 131.17 154.71 159.44 174.10 214.97 217.03 240.23 248.94 266.31 285.57 291.93 312.92 319.14 359.64 447.16 469.29 509.52 514.50 516.85 550.07 580.02 591.75 611.50 641.97 666.71 667.68 676.56 722.10 738.93 759.87 788.43 800.48 823.48 881.92 897.85 916.74 928.07 961.62 970.38 995.96 1001.46 1027.03 1039.90 1071.28 1085.41 1100.79 1147.22 1169.84 1189.16 1216.94 1235.53 1243.15 1256.48 1273.70 1284.04 1291.22 1312.80 1315.99 1340.51 1350.64 1353.16 1367.53 1404.62 1408.16 1429.19 1454.37 1468.19 1472.54 1475.87 1484.14 1498.57 1512.80 1558.66 1578.35 1663.01 1670.53 1756.92 1791.22 1796.76 1847.69 2759.60 3023.65 3072.18 3079.08 3103.63 3117.46 3127.92 3135.83 3148.16 3165.14 3167.75 3192.97 3426.86 3508.15 3531.46 3632.55 3673.88 3799.66
frequency: 21.18 31.97 35.83 42.34 59.14 72.18 84.82 96.32 107.06 112.73 131.17 154.71 159.44 174.10 214.97 217.03 240.23 248.94 266.31 285.57 291.93 312.92 319.14 359.64 447.16 469.29 509.52 514.50 516.85 550.07 580.02 591.75 611.50 641.97 666.71 667.68 676.56 722.10 738.93 759.87 788.43 800.48 823.48 881.92 897.85 916.74 928.07 961.62 970.38 995.96 1001.46 1027.03 1039.90 1071.28 1085.41 1100.79 1147.22 1169.84 1189.16 1216.94 1235.53 1243.15 1256.48 1273.70 1284.04 1291.22 1312.80 1315.99 1340.51 1350.64 1353.16 1367.53 1404.62 1408.16 1429.19 1454.37 1468.19 1472.54 1475.87 1484.14 1498.57 1512.80 1558.66 1578.35 1663.01 1670.53 1756.92 1791.22 1796.76 1847.69 2759.60 3023.65 3072.18 3079.08 3103.63 3117.46 3127.92 3135.83 3148.16 3165.14 3167.75 3192.97 3426.86 3508.15 3531.46 3632.55 3673.88 3799.66
formula: C10H18N3O6S
InChI: InChI=1S/C10H18N3O6S/c11-5(10(18)19)1-2-7(14)13-6(4-20)9(17)12-3-8(15)16/h5-6,12-13,15,18,20H,1-4H2,11H3
38 atoms
N  -1.249536 0.736327 2.36676
H  -0.666493 -0.073319 2.243504
C  -2.056301 0.842017 3.551683
H  -2.798227 1.624967 3.388748
C  -1.304589 1.175253 4.819424
O  -0.100569 1.183526 4.987536
C  -1.520133 1.539486 1.297837
C  -0.81176 1.227344 -0.030643
O  -2.289791 2.475648 1.352988
N  0.006751 0.03274 -0.008221
H  -0.147652 2.071836 -0.220727
C  -1.860128 1.156647 -1.142731
H  -0.472663 -0.849272 -0.102987
H  -2.495517 2.036403 -1.075352
H  -1.37864 1.148522 -2.118043
O  -2.147144 1.44383 5.806512
H  -1.642258 1.627251 6.610781
H  -2.604513 -0.084553 3.749275
S  -2.933361 -0.303111 -0.988968
H  -2.352308 -1.047452 -1.935531
C  1.354363 0.070353 0.062817
O  1.986024 1.115087 0.148202
C  2.054653 -1.281081 0.062292
H  1.362586 -2.055965 0.385043
H  2.338043 -1.49939 -0.969458
C  3.325003 -1.315176 0.943412
H  4.206951 -1.131723 0.325363
H  3.418957 -2.321081 1.3624
C  3.326825 -0.287053 2.064957
H  3.431603 0.717669 1.661358
N  4.512464 -0.489188 2.988107
H  4.529931 -1.432983 3.378837
H  5.391204 -0.33565 2.492254
C  2.076399 -0.284006 2.948115
O  1.171035 -1.064872 2.802324
O  2.151549 0.677621 3.841689
H  1.262389 0.820891 4.291469
H  4.449065 0.17979 3.760859
totalener: -1406.23229254 hartree
nucrepener: 1887.46625524 hartree
electener: -3293.69854778 hartree
oneelecener: -5660.28020957 hartree
twoeener: 2366.58166179 hartree
kineticenergy: 1400.64541347 hartree
exchangeener: -105.330084825497 hartree
correlationener: -7.056070719220 hartree
xcener: -112.386155544716 hartree
temp: 298.15 k
press: 1.00 atm
thermalcorrenthalpy: 0.00094421 hartree
totalenthalpy: -1405.98314452 hartree
totalentropycorr: -0.06569364 hartree
gibbsenthalpy: -1406.04883816 hartree
gibbsminuselec: 0.26315405 hartree
chargesum: 1.0000000
charge: -0.208409 0.188925 -0.086288 0.149933 0.361810 -0.363952 0.193629 0.092987 -0.349432 -0.210215 0.124990 -0.159920 0.161754 0.149664 0.125189 -0.227867 0.242211 0.146356 -0.154333 0.104826 0.201945 -0.390311 -0.163328 0.124934 0.134169 -0.200426 0.121253 0.110740 -0.028030 0.208118 -0.043280 0.233790 0.241698 0.296007 -0.324508 -0.324395 0.269495 0.250275
charge: 0.323882 -0.050731 -0.036815 0.047534 -0.385789 0.170376 -0.379173 -0.130057 0.104174 0.339285 0.045368 -0.220384 -0.037744 0.018580 0.008053 0.405925 -0.073237 0.040980 0.486839 -0.156258 -0.391626 0.081301 0.004544 0.029190 0.039113 0.001715 0.032526 0.030999 -0.052058 0.036719 0.616301 0.059226 0.060096 -0.467717 0.140809 0.362918 -0.165988 0.061124
qa: -0.2084 0.1889 -0.0863 0.1499 0.3618 -0.3640 0.1936 0.0930 -0.3494 -0.2102 0.1250 -0.1599 0.1618 0.1497 0.1252 -0.2279 0.2422 0.1464 -0.1543 0.1048 0.2019 -0.3903 -0.1633 0.1249 0.1342 -0.2004 0.1213 0.1107 -0.0280 0.2081 -0.0433 0.2338 0.2417 0.2960 -0.3245 -0.3244 0.2695 0.2503
va: 3.1134 1.0307 3.7963 1.0405 4.2173 2.1062 4.3496 3.7786 2.1918 3.1142 1.0371 3.9475 1.0640 1.0177 1.0014 2.2750 1.0151 1.0012 2.1688 1.0198 4.2443 2.1087 3.8418 1.0215 1.0037 3.9619 1.0045 1.0092 3.7214 1.0269 3.6352 0.9773 0.9664 4.3365 2.1603 2.1879 1.0879 0.9775
dispcorr: -0.080305449 hartree
energy: -1406.318300699537
dipole: 13.03612 -7.30000 5.73612 -7.12937 4.55635 -2.57302 -4.30683 6.01546 1.70864
magnitude: 6.51483 au
magnitude: 16.55937 debye
zeropoint: 0.31046941 hartree
thermalvibcorrection: 0.01878829 hartree
thermalrotcorrection: 0.00141627 hartree
thermaltrasncorrection: 0.00141627 hartree
thermaltotal: -1405.98621046 hartree
thermalcorr: 0.02162083 hartree
nonthermalcorr: 0.31046941 hartree
totalcorr: 0.33209024 hartree
totalenthalpy: -1405.98526625 hartree
