program: Orca
programVersion: 5.0.2
elementType: N H C H C O C C O N H C H H H O H H S H C O C H H C H H C H N H H C O O H H
charge: 1
multiplicity: 1
keywords: wB97X-D3BJ Opt Freq def2-TZVPP def2/J RIJCOSX VeryTightSCF
keywords: PAL8 defgrid3 TightOpt
frequency: 0.00 0.00 0.00 0.00 0.00 0.00 21.86 32.22 40.37 42.95 54.22 66.96 93.68 98.29 122.19 128.32 137.96 147.08 153.17 197.66 215.34 235.29 260.27 274.20 285.12 309.65 318.35 342.03 360.50 386.60 430.77 448.09 474.68 478.62 493.41 520.78 561.33 575.33 593.31 629.82 631.82 654.22 663.89 705.46 750.13 775.83 794.59 811.10 832.56 844.67 871.13 905.62 914.12 939.28 983.99 988.79 1009.68 1026.52 1044.29 1064.76 1086.85 1103.92 1122.89 1156.99 1169.29 1201.10 1212.92 1218.03 1224.61 1269.88 1278.23 1281.65 1294.89 1317.37 1332.21 1354.22 1377.43 1381.28 1389.91 1408.87 1425.59 1433.40 1456.01 1480.44 1480.72 1492.95 1501.77 1566.93 1574.31 1584.74 1640.45 1682.27 1739.39 1753.35 1826.91 1862.12 2768.56 3087.54 3095.09 3108.23 3118.38 3128.05 3134.50 3136.75 3157.28 3160.15 3165.55 3209.47 3359.26 3533.08 3679.80 3692.91 3789.80 3797.02
frequency: 21.86 32.22 40.37 42.95 54.22 66.96 93.68 98.29 122.19 128.32 137.96 147.08 153.17 197.66 215.34 235.29 260.27 274.20 285.12 309.65 318.35 342.03 360.50 386.60 430.77 448.09 474.68 478.62 493.41 520.78 561.33 575.33 593.31 629.82 631.82 654.22 663.89 705.46 750.13 775.83 794.59 811.10 832.56 844.67 871.13 905.62 914.12 939.28 983.99 988.79 1009.68 1026.52 1044.29 1064.76 1086.85 1103.92 1122.89 1156.99 1169.29 1201.10 1212.92 1218.03 1224.61 1269.88 1278.23 1281.65 1294.89 1317.37 1332.21 1354.22 1377.43 1381.28 1389.91 1408.87 1425.59 1433.40 1456.01 1480.44 1480.72 1492.95 1501.77 1566.93 1574.31 1584.74 1640.45 1682.27 1739.39 1753.35 1826.91 1862.12 2768.56 3087.54 3095.09 3108.23 3118.38 3128.05 3134.50 3136.75 3157.28 3160.15 3165.55 3209.47 3359.26 3533.08 3679.80 3692.91 3789.80 3797.02
formula: C10H18N3O6S
InChI: InChI=1S/C10H18N3O6S/c11-5(10(18)19)1-2-7(14)13-6(4-20)9(17)12-3-8(15)16/h5-6,12-13,15,18,20H,1-4H2,11H3
38 atoms
N  0.216368 3.369964 -1.059876
H  0.193981 3.750759 -0.129489
C  1.069236 4.040088 -2.029938
H  0.785775 3.732297 -3.031793
C  2.515026 3.634082 -1.768382
O  3.14116 2.82611 -2.415565
C  -0.072692 2.065628 -1.226344
C  -0.671881 1.291658 -0.040286
O  0.10932 1.490053 -2.293496
N  0.035711 0.021585 0.035884
H  -1.702362 1.061611 -0.31788
C  -0.675872 2.027612 1.29825
H  -0.487987 -0.832966 -0.031334
H  0.334378 2.340763 1.56257
H  -1.328608 2.898222 1.232658
O  3.005119 4.250415 -0.696405
H  3.893364 3.910991 -0.518876
H  0.959616 5.117757 -1.922414
S  -1.325433 0.902118 2.56606
H  -1.859708 1.841328 3.352413
C  1.383051 -0.006479 -0.022671
O  2.045257 1.024892 -0.052988
C  2.049581 -1.365342 -0.106478
H  1.335345 -2.141679 -0.390355
H  2.404729 -1.613072 0.896538
C  3.253319 -1.328552 -1.050076
H  3.813548 -2.258458 -0.952721
H  3.916688 -0.514241 -0.756078
C  2.922415 -1.182861 -2.54149
H  3.842411 -1.318538 -3.111953
N  2.369983 0.153382 -2.908436
H  1.389983 0.318335 -2.600285
H  2.907536 0.944882 -2.529113
C  1.906987 -2.220963 -2.997823
O  0.798285 -1.942303 -3.364788
O  2.406274 -3.452169 -2.906997
H  1.735913 -4.084425 -3.203334
H  2.344597 0.264667 -3.920948
totalener: -1406.25314670 hartree
nucrepener: 1929.36621115 hartree
electener: -3335.61935786 hartree
oneelecener: -5742.95593338 hartree
twoeener: 2407.33657552 hartree
kineticenergy: 1400.68615301 hartree
exchangeener: -105.333611053245 hartree
correlationener: -7.056182816875 hartree
xcener: -112.389793870120 hartree
temp: 298.15 k
press: 1.00 atm
thermalcorrenthalpy: 0.00094421 hartree
totalenthalpy: -1406.00634254 hartree
totalentropycorr: -0.06540553 hartree
gibbsenthalpy: -1406.07174807 hartree
gibbsminuselec: 0.26438356 hartree
chargesum: 1.0000000
charge: -0.158680 0.188872 -0.074034 0.137495 0.354132 -0.385043 0.212546 0.113940 -0.424811 -0.182277 0.139326 -0.247010 0.194369 0.127948 0.133681 -0.244281 0.241696 0.152032 -0.139119 0.119842 0.214949 -0.406964 -0.158324 0.097262 0.140137 -0.208227 0.144326 0.133661 0.002575 0.165162 -0.073658 0.238416 0.242560 0.250016 -0.274966 -0.247809 0.253514 0.226746
charge: 0.345941 -0.018564 -0.021848 0.037299 -0.417591 0.104313 -0.358749 -0.133928 0.103680 0.348313 0.047331 -0.242030 -0.015506 0.000955 0.006354 0.391721 -0.073835 0.036827 0.482092 -0.143908 -0.386517 0.077451 0.000631 0.028233 0.047994 0.004543 0.042992 0.035658 -0.057664 0.047612 0.609545 -0.008659 0.013390 -0.450781 0.137835 0.394075 -0.068580 0.053374
qa: -0.1587 0.1889 -0.0740 0.1375 0.3541 -0.3850 0.2125 0.1139 -0.4248 -0.1823 0.1393 -0.2470 0.1944 0.1279 0.1337 -0.2443 0.2417 0.1520 -0.1391 0.1198 0.2149 -0.4070 -0.1583 0.0973 0.1401 -0.2082 0.1443 0.1337 0.0026 0.1652 -0.0737 0.2384 0.2426 0.2500 -0.2750 -0.2478 0.2535 0.2267
va: 3.2097 1.0151 3.8404 1.0253 4.2022 2.0931 4.2595 3.7449 2.0784 3.2175 1.0125 4.0192 1.0059 1.0042 0.9984 2.2531 1.0168 1.0004 2.1739 1.0206 4.2243 2.0957 3.8403 1.0226 1.0040 3.9036 1.0102 1.0198 3.8083 0.9960 3.6850 1.0556 1.0209 4.4100 2.2168 2.2599 1.0056 0.9812
dispcorr: -0.083382472 hartree
energy: -1406.341881690851
dipole: 2.98171 -1.93391 1.04780 -0.71322 0.27599 -0.43723 1.03668 -1.68771 -0.65104
magnitude: 1.30878 au
magnitude: 3.32666 debye
zeropoint: 0.31107969 hartree
thermalvibcorrection: 0.01861267 hartree
thermalrotcorrection: 0.00141627 hartree
thermaltrasncorrection: 0.00141627 hartree
thermaltotal: -1406.00935678 hartree
thermalcorr: 0.02144521 hartree
nonthermalcorr: 0.31107969 hartree
totalcorr: 0.33252491 hartree
totalenthalpy: -1406.00841257 hartree
