program: Gaussian 09
title: 000048550
version: EM64L-G09RevD.01
frameworkgroup: C1[X(C11H14N2O3)]
method: RPBEPBE
basis: SDD
operation: Freq
keyword: #p
keyword: freq=noraman
keyword: PBEPBE/SDD
title: #p freq=noraman PBEPBE/SDD
converged: YES YES NO NO
title: Mulliken charges:
elementType: O O O N N C C C C C C C C C C C H H H H H H H H H H H H H H
charge: -0.211531 -0.203334 -0.220783 -0.373309 -0.378755 0.104401 -0.611799 -0.535183 0.176480 0.168553 0.554426 -0.058250 0.151127 -0.830435 -0.696496 -0.579352 0.238923 0.257011 0.246562 0.230644 0.366752 0.363355 0.242516 0.231908 0.246014 0.229301 0.216913 0.227879 0.216899 0.229565
chargesum: 0.00000
title: Mulliken charges with hydrogens summed into heavy atoms:
elementType: O O O N N C C C C C C C C C C C
charge: -0.211531 -0.203334 -0.220783 -0.006557 -0.015400 0.104401 -0.115865 -0.057977 0.176480 0.168553 0.554426 0.184266 0.151127 -0.123212 -0.251705 -0.132888
polarizability: 1.52547745e+02 -1.42465261e+00 1.49389316e+02 -6.52991407e+00 -1.73629896e+01 1.15200538e+02
1716.lowfreq: -8.7380 -5.7298 -0.0005 -0.0005 -0.0004 9.6116 25.0124 33.0011 65.3922
frequency: 24.6696 32.9990 65.3278 81.8062 105.2336 134.4662 144.2411 156.7291 168.0176 173.4112 199.1082 200.8423 276.7903 348.9981 359.2279 373.5253 379.1438 401.7971 426.9294 447.5674 483.9029 533.8883 587.4964 625.4296 632.4601 649.2816 659.9305 691.3025 742.1961 756.2103 770.9471 785.6722 827.9718 837.3478 896.6264 927.1901 946.8834 955.1422 965.0519 978.1469 990.9298 1010.5746 1017.7426 1024.6885 1051.6531 1093.2252 1144.3143 1178.1673 1226.9793 1265.3483 1280.6469 1292.1546 1294.0777 1310.3415 1329.7687 1363.3728 1374.6331 1375.7173 1397.1539 1424.6962 1429.9196 1448.1081 1464.8034 1469.3319 1481.2562 1618.7623 1653.2671 1659.2512 1665.3734 1676.2553 2971.3305 2988.1685 3013.7066 3049.0254 3051.3242 3080.1678 3089.4755 3090.6002 3093.5490 3105.1962 3195.3262 3200.1513 3517.9279 3520.2293
redmass: 3.4287 6.9157 3.0456 3.8227 4.1423 3.0043 6.8278 8.1798 1.3275 2.1139 4.5334 3.4415 3.7124 4.2229 10.4574 3.0020 2.3624 3.0420 2.1707 2.8929 7.7267 3.3509 4.0370 3.3816 2.7873 2.6309 1.5958 3.1207 1.7694 1.8999 3.3240 1.6986 2.6283 2.8417 1.6061 2.9284 1.3573 1.3780 2.1999 1.7645 3.4741 1.5416 1.3233 1.7736 1.5508 2.6983 2.3806 3.1156 1.4737 1.6801 1.5651 1.8788 1.4665 1.7562 1.7920 8.1509 1.9947 1.5370 1.2079 1.1563 1.1903 1.1085 1.0768 1.0693 1.0733 7.1865 8.9026 4.6903 4.7939 5.4861 1.0388 1.0587 1.0588 1.0948 1.1034 1.0936 1.0688 1.0978 1.0648 1.0940 1.1143 1.1150 1.0761 1.0778
irintensity: 0.0576 0.6851 0.2821 0.2497 0.1605 1.2865 0.3453 9.5793 1.0901 0.4186 0.3550 0.7757 1.4199 6.9179 23.2429 8.9223 4.2790 1.9246 4.0757 14.0701 13.6404 8.0965 6.7166 9.6905 16.4564 6.1159 17.0456 12.4664 25.1017 8.0950 1.2017 184.3922 6.2649 6.0436 1.0141 17.9390 56.0027 62.5984 16.4053 7.5902 5.8706 4.9914 19.3871 13.8604 5.6494 13.0907 4.6649 38.4972 24.3280 20.0348 70.6949 21.5342 61.9196 72.3696 111.4699 205.6186 10.3473 8.0696 30.9686 8.2178 1.7768 19.9549 7.1986 21.1924 10.9093 280.5083 83.1578 15.8242 11.6520 614.5097 24.7377 13.0197 15.5426 22.3396 8.3124 0.0482 8.0560 25.4102 3.2311 9.8371 22.8101 21.5663 79.0488 48.2920
temp: 298.150 k
press: 1.00000 atm
elementType: 8 8 8 7 7 6 6 6 6 6 6 6 6 6 6 6 1 1 1 1 1 1 1 1 1 1 1 1 1 1
symmnumber: 1
zpe: 620458.7 jmol-1
zpe.correction: 0.236320 hartree
zpe.thermalcorrener: 0.252639 hartree
zpe.thermalcorrenthalpy: 0.253584 hartree
zpe.thermalcorrgfe: 0.191642 hartree
zpe.sumelectzpe: -761.553150 hartree
zpe.sumelectthermal: -761.536831 hartree
zpe.sumelectthermalent: -761.535886 hartree
zpe.sumelectthermalfe: -761.597828 hartree
dipole: -1.6024 -0.2779 -0.6405
dipole: 1.7479
quadrupole: -97.4720 -97.8694 -99.6381
quadrupole: 5.0588 4.1022 1.7530
quadrupole: 0.8545 0.4571 -1.3116 5.0588 4.1022 1.7530
hfenergy: -761.78947 hartree
pointgroup: C01 [X(C11H14N2O3)]
dipole: -0.5997094 -0.1830674 -0.2823919 debye
polarizability: 153.1591447|-0.1316438|149.7783378|-2.5956313|-17.3922669|114.2001164 unknown
InChI: InChI=1S/C11H14N2O3/c1-4-5-11(6-7(2)3)8(14)12-10(16)13-9(11)15/h4,12-13H,1-2,5-6H2,3H3
charge 0 multiplicity 1
30 atoms
O  0.758733 1.64508 -1.909251
O  -0.436142 -0.738335 2.10429
O  3.633313 -1.471856 -0.000579
N  2.149108 0.069461 -0.944724
N  1.510064 -1.198663 0.943588
C  -0.22787 0.233094 -0.152017
C  -1.045676 -0.759286 -1.113553
C  -1.10202 1.435119 0.319621
C  0.916288 0.740417 -1.051235
C  0.249288 -0.571395 1.065337
C  -2.370546 -1.293398 -0.579389
C  -0.357034 2.391191 1.23261
C  2.508031 -0.914839 -0.005239
C  -3.627039 -0.533516 -0.972001
C  -2.423208 -2.440696 0.148281
C  0.032504 3.643092 0.885176
H  -0.376269 -1.603342 -1.367602
H  -1.220247 -0.18378 -2.042879
H  -1.965308 1.012486 0.864264
H  -1.463784 1.965217 -0.578287
H  2.885258 0.339894 -1.605361
H  1.788398 -1.831577 1.701017
H  -0.144863 2.017487 2.245436
H  -4.528147 -0.988849 -0.527297
H  -3.586852 0.525725 -0.658649
H  -3.752977 -0.532124 -2.072976
H  -1.521491 -3.009067 0.404971
H  -3.373114 -2.840572 0.520376
H  0.559541 4.294717 1.591602
H  -0.159737 4.045715 -0.116731
