program: Orca
programVersion: 5.0.2
elementType: N H C H C O C C O N H C H H H O H H S H C O C H H C H H C H N H H C O O H H
charge: 1
multiplicity: 1
keywords: wB97X-D3BJ Opt Freq def2-TZVPP def2/J RIJCOSX VeryTightSCF
keywords: PAL8 defgrid3 TightOpt
frequency: 0.00 0.00 0.00 0.00 0.00 0.00 33.27 50.62 53.99 62.46 71.32 82.90 97.15 105.01 132.77 137.31 149.42 164.91 193.46 215.21 223.30 248.35 258.58 264.63 281.53 287.63 311.25 319.42 366.44 373.47 381.76 459.62 478.14 496.73 504.55 521.26 543.98 560.04 590.68 626.33 628.97 651.85 672.49 683.83 698.79 753.00 779.36 790.74 811.37 828.69 887.06 907.62 909.37 922.40 964.79 999.71 1028.16 1052.65 1066.97 1085.00 1115.66 1119.16 1125.32 1163.50 1193.16 1193.86 1215.90 1227.97 1248.58 1257.85 1281.70 1287.50 1297.45 1318.13 1334.10 1359.22 1373.93 1381.83 1412.31 1416.85 1427.92 1450.88 1464.52 1473.77 1482.18 1484.05 1496.32 1546.91 1564.06 1628.56 1635.95 1662.17 1718.48 1779.75 1827.12 1844.04 2753.31 2854.50 3070.76 3094.43 3095.96 3108.77 3112.97 3117.76 3123.29 3153.59 3166.00 3175.93 3487.41 3571.56 3671.94 3675.55 3688.44 3811.76
frequency: 33.27 50.62 53.99 62.46 71.32 82.90 97.15 105.01 132.77 137.31 149.42 164.91 193.46 215.21 223.30 248.35 258.58 264.63 281.53 287.63 311.25 319.42 366.44 373.47 381.76 459.62 478.14 496.73 504.55 521.26 543.98 560.04 590.68 626.33 628.97 651.85 672.49 683.83 698.79 753.00 779.36 790.74 811.37 828.69 887.06 907.62 909.37 922.40 964.79 999.71 1028.16 1052.65 1066.97 1085.00 1115.66 1119.16 1125.32 1163.50 1193.16 1193.86 1215.90 1227.97 1248.58 1257.85 1281.70 1287.50 1297.45 1318.13 1334.10 1359.22 1373.93 1381.83 1412.31 1416.85 1427.92 1450.88 1464.52 1473.77 1482.18 1484.05 1496.32 1546.91 1564.06 1628.56 1635.95 1662.17 1718.48 1779.75 1827.12 1844.04 2753.31 2854.50 3070.76 3094.43 3095.96 3108.77 3112.97 3117.76 3123.29 3153.59 3166.00 3175.93 3487.41 3571.56 3671.94 3675.55 3688.44 3811.76
formula: C10H18N3O6S
InChI: InChI=1S/C10H18N3O6S/c11-5(10(18)19)1-2-7(14)13-6(4-20)9(17)12-3-8(15)16/h5-6,12-13,15,18,20H,1-4H2,11H3
38 atoms
N  0.081619 2.975056 1.979213
H  -0.07395 3.616525 1.2200
C  0.597429 3.49697 3.220594
H  -0.023755 4.319185 3.579494
C  2.033116 3.98117 3.103529
O  2.736301 3.87784 2.130794
C  -0.112861 1.681434 1.745789
C  -0.63713 1.298482 0.351217
O  0.075656 0.798141 2.592775
N  0.031158 0.071364 -0.044213
H  -0.388902 2.086214 -0.361403
C  -2.150652 1.079111 0.382803
H  -0.482355 -0.791705 0.01025
H  -2.472969 0.621576 -0.552291
H  -2.407594 0.397693 1.196483
O  2.412732 4.550432 4.248682
H  3.326843 4.849364 4.156104
H  0.574289 2.707299 3.970156
S  -3.092193 2.593015 0.672762
H  -3.024181 3.060601 -0.579228
C  1.384688 0.054257 0.0676
O  2.011992 1.088952 0.206795
C  2.083985 -1.288206 0.098344
H  1.418558 -2.061955 0.493749
H  2.31555 -1.587489 -0.926501
C  3.398284 -1.200379 0.880199
H  4.084639 -0.537944 0.354853
H  3.853415 -2.192155 0.893735
C  3.32068 -0.683706 2.32662
H  4.103088 -1.18177 2.905272
N  2.022113 -1.000236 3.016651
H  1.229657 -0.383094 2.682591
H  1.774594 -1.982876 2.935161
C  3.514492 0.813821 2.599007
O  2.952414 1.314957 3.543071
O  4.368403 1.409838 1.79946
H  4.280396 2.371953 1.921941
H  2.111439 -0.749747 4.002329
totalener: -1406.24295303 hartree
nucrepener: 1957.59974822 hartree
electener: -3363.84270126 hartree
oneelecener: -5799.99020518 hartree
twoeener: 2436.14750392 hartree
kineticenergy: 1400.68141509 hartree
exchangeener: -105.333708726236 hartree
correlationener: -7.059068360595 hartree
xcener: -112.392777086831 hartree
temp: 298.15 k
press: 1.00 atm
thermalcorrenthalpy: 0.00094421 hartree
totalenthalpy: -1405.99745571 hartree
totalentropycorr: -0.06476523 hartree
gibbsenthalpy: -1406.06222094 hartree
gibbsminuselec: 0.26408683 hartree
chargesum: 1.0000000
charge: -0.097615 0.183105 -0.082555 0.160473 0.319089 -0.363038 0.297612 0.039993 -0.470832 -0.190411 0.112952 -0.187550 0.167865 0.141369 0.131030 -0.244706 0.236746 0.134381 -0.132846 0.109068 0.193171 -0.339026 -0.200851 0.093607 0.142126 -0.170612 0.142772 0.130729 -0.032682 0.160156 -0.060240 0.228353 0.210621 0.342133 -0.362947 -0.244048 0.267093 0.235513
charge: 0.373645 -0.005371 -0.029404 0.039039 -0.442124 0.102522 -0.358920 -0.142380 0.089493 0.332216 0.034426 -0.242853 -0.023997 0.010300 0.014125 0.387087 -0.081455 0.041902 0.501334 -0.145398 -0.391879 0.124513 -0.012511 0.019239 0.047881 0.003316 0.046504 0.031696 -0.043310 0.046913 0.605276 -0.030595 0.036170 -0.450637 0.122365 0.413711 -0.072268 0.049429
qa: -0.0976 0.1831 -0.0826 0.1605 0.3191 -0.3630 0.2976 0.0400 -0.4708 -0.1904 0.1130 -0.1876 0.1679 0.1414 0.1310 -0.2447 0.2367 0.1344 -0.1328 0.1091 0.1932 -0.3390 -0.2009 0.0936 0.1421 -0.1706 0.1428 0.1307 -0.0327 0.1602 -0.0602 0.2284 0.2106 0.3421 -0.3629 -0.2440 0.2671 0.2355
va: 3.3181 1.0210 3.7375 1.0005 4.3430 2.1292 4.0913 3.9352 2.0423 3.2129 1.0151 3.9242 1.0236 0.9941 1.0070 2.2484 1.0205 1.0346 2.1605 1.0213 4.2339 2.1496 3.8387 1.0132 1.0090 3.8610 1.0213 0.9987 3.8149 0.9915 3.6279 1.0987 0.9851 4.3433 2.1344 2.2912 1.0198 0.9884
dispcorr: -0.083939787 hartree
energy: -1406.332950575181
dipole: 0.26543 0.29646 0.56189 -12.51263 9.60965 -2.90297 -2.69601 3.02219 0.32618
magnitude: 2.97479 au
magnitude: 7.56131 debye
zeropoint: 0.31054816 hartree
thermalvibcorrection: 0.01834281 hartree
thermalrotcorrection: 0.00141627 hartree
thermaltrasncorrection: 0.00141627 hartree
thermaltotal: -1406.00122706 hartree
thermalcorr: 0.02117536 hartree
nonthermalcorr: 0.31054816 hartree
totalcorr: 0.33172352 hartree
totalenthalpy: -1406.00028285 hartree
