program: Orca
programVersion: 5.0.2
elementType: N H C H C O C C O N H C H H H O H H S H C O C H H C H H C H N H H C O O H H
charge: 1
multiplicity: 1
keywords: wB97X-D3BJ Opt Freq def2-TZVPP def2/J RIJCOSX VeryTightSCF
keywords: PAL8 defgrid3 TightOpt
frequency: 0.00 0.00 0.00 0.00 0.00 0.00 23.56 32.64 41.31 55.40 59.13 74.72 98.18 99.37 116.91 127.37 143.44 152.13 166.74 209.42 220.88 239.63 263.37 284.65 298.45 319.13 328.12 339.02 366.90 377.53 419.61 425.39 448.91 493.26 508.66 522.86 527.09 533.38 549.37 583.43 625.37 635.94 657.90 701.81 716.18 761.72 785.98 806.84 820.15 850.98 886.16 891.00 904.25 941.38 971.87 994.70 1006.99 1031.11 1050.21 1072.18 1114.68 1138.42 1143.00 1157.49 1181.65 1196.17 1198.58 1218.74 1251.32 1276.52 1285.16 1295.18 1316.51 1327.37 1341.01 1347.45 1357.96 1374.15 1396.76 1400.54 1431.05 1442.75 1448.56 1467.57 1474.19 1499.14 1503.94 1541.41 1581.57 1604.96 1632.03 1673.79 1718.45 1773.95 1837.31 1879.70 2765.99 2863.89 3089.42 3097.26 3102.84 3108.84 3112.79 3114.39 3148.83 3158.70 3164.87 3171.01 3424.33 3565.69 3688.77 3707.36 3776.72 3811.71
frequency: 23.56 32.64 41.31 55.40 59.13 74.72 98.18 99.37 116.91 127.37 143.44 152.13 166.74 209.42 220.88 239.63 263.37 284.65 298.45 319.13 328.12 339.02 366.90 377.53 419.61 425.39 448.91 493.26 508.66 522.86 527.09 533.38 549.37 583.43 625.37 635.94 657.90 701.81 716.18 761.72 785.98 806.84 820.15 850.98 886.16 891.00 904.25 941.38 971.87 994.70 1006.99 1031.11 1050.21 1072.18 1114.68 1138.42 1143.00 1157.49 1181.65 1196.17 1198.58 1218.74 1251.32 1276.52 1285.16 1295.18 1316.51 1327.37 1341.01 1347.45 1357.96 1374.15 1396.76 1400.54 1431.05 1442.75 1448.56 1467.57 1474.19 1499.14 1503.94 1541.41 1581.57 1604.96 1632.03 1673.79 1718.45 1773.95 1837.31 1879.70 2765.99 2863.89 3089.42 3097.26 3102.84 3108.84 3112.79 3114.39 3148.83 3158.70 3164.87 3171.01 3424.33 3565.69 3688.77 3707.36 3776.72 3811.71
formula: C10H18N3O6S
InChI: InChI=1S/C10H18N3O6S/c11-5(10(18)19)1-2-7(14)13-6(4-20)9(17)12-3-8(15)16/h5-6,12-13,15,18,20H,1-4H2,11H3
38 atoms
N  0.026149 3.470243 -0.943705
H  0.036908 3.818829 -0.002986
C  0.428893 4.336881 -2.019241
H  -0.223676 4.195087 -2.881886
C  1.856636 4.123479 -2.491557
O  2.688079 3.429246 -1.958674
C  -0.17727 2.154968 -1.174534
C  -0.733433 1.30233 -0.016337
O  -0.008096 1.655633 -2.273261
N  -0.04105 0.021098 -0.00629
H  -1.764585 1.083754 -0.301762
C  -0.754979 1.966687 1.360318
H  -0.544527 -0.804174 -0.280815
H  0.239105 2.313205 1.638235
H  -1.44994 2.805841 1.335753
O  2.084925 4.836697 -3.594236
H  3.007046 4.7219 -3.858877
H  0.332563 5.377621 -1.706972
S  -1.347149 0.748352 2.568246
H  -1.749232 1.629769 3.489288
C  1.285519 -0.042553 0.131756
O  1.943371 0.986231 0.347921
C  1.935117 -1.400782 0.006353
H  2.019037 -1.807646 1.017717
H  1.288385 -2.065915 -0.561336
C  3.339588 -1.3696 -0.622946
H  3.580916 -2.385911 -0.932696
H  4.082748 -1.095954 0.130019
C  3.549474 -0.450095 -1.83527
H  4.400545 -0.807163 -2.419428
N  3.876806 0.944532 -1.386956
H  3.243604 1.153939 -0.567984
H  4.849087 1.027224 -1.103661
C  2.356076 -0.421847 -2.791505
O  1.563387 -1.313432 -2.871952
O  2.346541 0.692834 -3.527043
H  1.478355 0.776372 -3.949164
H  3.66378 1.652919 -2.096512
totalener: -1406.25676160 hartree
nucrepener: 1959.50382616 hartree
electener: -3365.76058776 hartree
oneelecener: -5803.31819750 hartree
twoeener: 2437.55760975 hartree
kineticenergy: 1401.50548573 hartree
exchangeener: -105.481335852291 hartree
correlationener: -7.066895164079 hartree
xcener: -112.548231016370 hartree
temp: 298.15 k
press: 1.00 atm
thermalcorrenthalpy: 0.00094421 hartree
totalenthalpy: -1406.00723182 hartree
totalentropycorr: -0.06997972 hartree
gibbsenthalpy: -1406.07721155 hartree
gibbsminuselec: 0.26281603 hartree
chargesum: 1.0000000
charge: -0.168412 0.180663 -0.092146 0.144532 0.338920 -0.392346 0.251772 0.087362 -0.418895 -0.176334 0.131208 -0.243912 0.200020 0.130948 0.134940 -0.238766 0.235466 0.144978 -0.140610 0.117987 0.300036 -0.439244 -0.172476 0.138805 0.134604 -0.220877 0.132081 0.117560 0.012211 0.152635 -0.057300 0.227912 0.212889 0.285795 -0.259655 -0.286027 0.267214 0.226460
charge: 0.340833 -0.023351 -0.039704 0.045559 -0.419695 0.091071 -0.370448 -0.130970 0.077245 0.364962 0.048273 -0.243180 -0.005434 -0.003238 0.004773 0.391443 -0.081269 0.042789 0.480910 -0.144388 -0.347378 0.129573 0.001038 0.045626 0.032386 0.009953 0.044254 0.032577 -0.047950 0.045609 0.601743 -0.048572 0.035049 -0.443416 0.164857 0.380014 -0.070957 0.009412
qa: -0.1684 0.1807 -0.0921 0.1445 0.3389 -0.3923 0.2518 0.0874 -0.4189 -0.1763 0.1312 -0.2439 0.2000 0.1309 0.1349 -0.2388 0.2355 0.1450 -0.1406 0.1180 0.3000 -0.4392 -0.1725 0.1388 0.1346 -0.2209 0.1321 0.1176 0.0122 0.1526 -0.0573 0.2279 0.2129 0.2858 -0.2597 -0.2860 0.2672 0.2265
va: 3.1800 1.0156 3.8449 1.0148 4.2343 2.0919 4.2438 3.7680 2.1094 3.2520 1.0128 4.0033 1.0035 1.0068 0.9990 2.2509 1.0220 1.0046 2.1765 1.0204 4.1268 2.0696 3.8251 1.0061 1.0195 3.9196 1.0064 1.0067 3.8257 0.9969 3.5832 1.0826 0.9852 4.3693 2.2386 2.2063 1.0024 1.0274
dispcorr: -0.083267013 hartree
energy: -1406.340027494159
dipole: 5.00713 -2.86378 2.14335 -1.32088 1.91200 0.59112 3.91801 -3.99651 -0.07850
magnitude: 2.22475 au
magnitude: 5.65487 debye
zeropoint: 0.31043463 hartree
thermalvibcorrection: 0.01858425 hartree
thermalrotcorrection: 0.00141627 hartree
thermaltrasncorrection: 0.00141627 hartree
thermaltotal: -1406.00817607 hartree
thermalcorr: 0.02141680 hartree
nonthermalcorr: 0.31043463 hartree
totalcorr: 0.33185143 hartree
totalenthalpy: -1406.00723186 hartree
