program: Orca
programVersion: 5.0.2
elementType: N H C H C O C C O N H C H H H O H H S H C O C H H C H H C H N H H C O O H H
charge: 1
multiplicity: 1
keywords: wB97X-D3BJ Opt Freq def2-TZVPP def2/J RIJCOSX VeryTightSCF
keywords: PAL8 defgrid3 TightOpt
frequency: 0.00 0.00 0.00 0.00 0.00 0.00 32.76 39.04 59.21 62.84 77.83 91.05 94.53 115.33 130.95 151.94 169.13 173.90 209.60 227.14 243.86 256.48 278.15 285.00 316.10 326.41 332.68 347.48 369.42 377.58 408.10 457.75 469.53 520.79 537.94 581.46 592.32 611.00 628.95 650.12 674.54 702.60 739.03 745.77 755.52 782.85 799.92 822.25 837.50 866.11 908.18 914.13 949.19 955.81 976.82 1007.48 1021.41 1037.66 1041.60 1063.97 1120.24 1126.34 1140.88 1156.78 1172.59 1206.16 1221.75 1252.82 1263.47 1271.40 1299.66 1330.56 1340.38 1353.46 1355.22 1382.65 1390.27 1394.02 1398.63 1406.55 1420.73 1469.93 1472.48 1484.86 1492.66 1495.31 1508.14 1563.71 1567.18 1622.81 1672.74 1689.60 1710.55 1757.44 1805.82 1848.90 2777.69 2866.82 3086.32 3095.09 3103.31 3110.16 3113.88 3129.82 3132.03 3138.01 3148.35 3154.72 3196.57 3396.77 3475.99 3536.69 3678.78 3784.11
frequency: 32.76 39.04 59.21 62.84 77.83 91.05 94.53 115.33 130.95 151.94 169.13 173.90 209.60 227.14 243.86 256.48 278.15 285.00 316.10 326.41 332.68 347.48 369.42 377.58 408.10 457.75 469.53 520.79 537.94 581.46 592.32 611.00 628.95 650.12 674.54 702.60 739.03 745.77 755.52 782.85 799.92 822.25 837.50 866.11 908.18 914.13 949.19 955.81 976.82 1007.48 1021.41 1037.66 1041.60 1063.97 1120.24 1126.34 1140.88 1156.78 1172.59 1206.16 1221.75 1252.82 1263.47 1271.40 1299.66 1330.56 1340.38 1353.46 1355.22 1382.65 1390.27 1394.02 1398.63 1406.55 1420.73 1469.93 1472.48 1484.86 1492.66 1495.31 1508.14 1563.71 1567.18 1622.81 1672.74 1689.60 1710.55 1757.44 1805.82 1848.90 2777.69 2866.82 3086.32 3095.09 3103.31 3110.16 3113.88 3129.82 3132.03 3138.01 3148.35 3154.72 3196.57 3396.77 3475.99 3536.69 3678.78 3784.11
formula: C10H18N3O6S
InChI: InChI=1S/C10H18N3O6S/c11-5(10(18)19)1-2-7(14)13-6(4-20)9(17)12-3-8(15)16/h5-6,12-13,15,18,20H,1-4H2,11H3
38 atoms
N  0.401814 2.841878 -1.780062
H  0.654116 3.269315 -0.893559
C  1.188733 3.186203 -2.956199
H  0.550774 3.196645 -3.841665
C  2.322512 2.179428 -3.157379
O  3.492057 2.430689 -2.942275
C  -0.2668 1.687987 -1.717897
C  -0.804297 1.194948 -0.366601
O  -0.419745 0.9458 -2.694126
N  0.036291 0.056268 0.035233
H  -1.766926 0.750215 -0.627033
C  -1.109264 2.200223 0.74717
H  -0.413269 -0.842925 0.038886
H  -1.897155 2.867616 0.391755
H  -1.522375 1.64367 1.58825
O  1.970418 0.971252 -3.571702
H  0.978756 0.876711 -3.498959
H  1.62351 4.171049 -2.811037
S  0.180744 3.316038 1.354771
H  1.071281 2.385408 1.708821
C  1.390007 0.07173 -0.049571
O  2.020167 1.111757 -0.189818
C  2.111245 -1.264282 -0.013463
H  2.685083 -1.325832 0.912486
H  1.40967 -2.098994 -0.020588
C  3.041829 -1.380779 -1.234021
H  2.469189 -1.12824 -2.129039
H  3.37047 -2.416718 -1.33921
C  4.265861 -0.448847 -1.172223
H  4.003809 0.445622 -0.606672
N  4.690235 0.013514 -2.532221
H  4.374925 -0.623637 -3.261344
H  4.298929 0.968824 -2.751823
C  5.49746 -1.079997 -0.540422
O  6.581415 -1.055215 -1.062661
O  5.228709 -1.63021 0.63916
H  6.047553 -1.992162 1.008196
H  5.717021 0.028918 -2.549443
totalener: -1406.24602586 hartree
nucrepener: 1936.09921354 hartree
electener: -3342.34523939 hartree
oneelecener: -5755.76855323 hartree
twoeener: 2413.42331383 hartree
kineticenergy: 1400.66245385 hartree
exchangeener: -105.329306711413 hartree
correlationener: -7.062252888968 hartree
xcener: -112.391559600381 hartree
temp: 298.15 k
press: 1.00 atm
thermalcorrenthalpy: 0.00094421 hartree
totalenthalpy: -1406.00127914 hartree
totalentropycorr: -0.06393441 hartree
gibbsenthalpy: -1406.06521355 hartree
gibbsminuselec: 0.26442563 hartree
chargesum: 1.0000000
charge: -0.139496 0.195305 -0.119044 0.158425 0.357031 -0.337980 0.233738 0.001307 -0.396802 -0.152394 0.144699 -0.168359 0.182786 0.137453 0.130368 -0.312695 0.251124 0.139940 -0.119855 0.120377 0.263766 -0.436821 -0.188002 0.126155 0.105255 -0.187133 0.109306 0.146656 -0.003967 0.152396 -0.064113 0.216841 0.231516 0.298493 -0.299466 -0.248479 0.249236 0.222434
charge: 0.346016 -0.066054 -0.021304 0.039285 -0.415421 0.148750 -0.356252 -0.116370 0.125495 0.342082 0.052591 -0.238826 -0.016684 0.021330 0.012599 0.353481 -0.164549 0.041798 0.535769 -0.147289 -0.381132 0.085738 0.004801 0.037399 0.029880 0.003555 0.027616 0.033781 -0.044701 0.035302 0.607822 0.041980 -0.028901 -0.430740 0.137789 0.397206 -0.065303 0.031460
qa: -0.1395 0.1953 -0.1190 0.1584 0.3570 -0.3380 0.2337 0.0013 -0.3968 -0.1524 0.1447 -0.1684 0.1828 0.1375 0.1304 -0.3127 0.2511 0.1399 -0.1199 0.1204 0.2638 -0.4368 -0.1880 0.1262 0.1053 -0.1871 0.1093 0.1467 -0.0040 0.1524 -0.0641 0.2168 0.2315 0.2985 -0.2995 -0.2485 0.2492 0.2224
va: 3.1825 1.0743 3.9010 0.9947 4.1210 2.1867 4.1917 3.8751 2.1333 3.1905 1.0083 3.9384 1.0113 1.0003 1.0034 2.1606 1.0794 1.0095 2.2178 1.0237 4.1738 2.0313 3.9006 1.0245 1.0144 3.8636 1.0291 1.0015 3.7939 1.0495 3.5667 0.9899 1.1001 4.3572 2.1959 2.2484 1.0089 1.0129
dispcorr: -0.084057416 hartree
energy: -1406.336095978317
dipole: -2.52799 2.95301 0.42503 -5.78543 3.92539 -1.86004 -0.23498 0.14297 -0.09201
magnitude: 1.91020 au
magnitude: 4.85533 debye
zeropoint: 0.31192791 hartree
thermalvibcorrection: 0.01757769 hartree
thermalrotcorrection: 0.00141627 hartree
thermaltrasncorrection: 0.00141627 hartree
thermaltotal: -1406.00375783 hartree
thermalcorr: 0.02041024 hartree
nonthermalcorr: 0.31192791 hartree
totalcorr: 0.33233815 hartree
totalenthalpy: -1406.00281362 hartree
