program: Orca
programVersion: 5.0.2
elementType: N H C H C O C C O N H C H H H O H H S H C O C H H C H H C H N H H C O O H H
charge: 1
multiplicity: 1
keywords: wB97X-D3BJ Opt Freq def2-TZVPP def2/J RIJCOSX VeryTightSCF
keywords: PAL8 defgrid3 TightOpt
frequency: 0.00 0.00 0.00 0.00 0.00 0.00 27.56 38.58 54.21 65.65 79.03 85.89 94.63 105.19 118.65 129.24 139.36 154.48 197.43 209.79 225.66 247.20 257.25 284.11 287.98 308.05 345.33 354.17 363.41 389.00 416.78 466.72 482.55 531.06 553.36 574.23 593.90 617.51 641.11 658.88 662.78 681.76 714.20 727.90 745.17 776.44 798.75 821.78 836.50 888.19 902.52 909.61 918.30 963.77 1005.80 1018.16 1037.36 1043.89 1069.32 1075.18 1078.11 1105.45 1133.17 1141.40 1162.65 1219.45 1227.48 1240.81 1258.54 1264.86 1286.43 1305.85 1319.90 1331.05 1351.43 1357.33 1362.01 1383.83 1401.72 1404.35 1427.46 1456.26 1468.43 1469.70 1479.91 1486.47 1493.96 1533.45 1572.61 1584.08 1640.80 1676.22 1753.64 1766.33 1783.78 1815.07 2757.53 2762.09 3071.32 3084.34 3092.36 3103.49 3103.99 3116.93 3130.96 3147.07 3154.36 3156.47 3180.63 3507.92 3568.70 3572.47 3585.70 3792.52
frequency: 27.56 38.58 54.21 65.65 79.03 85.89 94.63 105.19 118.65 129.24 139.36 154.48 197.43 209.79 225.66 247.20 257.25 284.11 287.98 308.05 345.33 354.17 363.41 389.00 416.78 466.72 482.55 531.06 553.36 574.23 593.90 617.51 641.11 658.88 662.78 681.76 714.20 727.90 745.17 776.44 798.75 821.78 836.50 888.19 902.52 909.61 918.30 963.77 1005.80 1018.16 1037.36 1043.89 1069.32 1075.18 1078.11 1105.45 1133.17 1141.40 1162.65 1219.45 1227.48 1240.81 1258.54 1264.86 1286.43 1305.85 1319.90 1331.05 1351.43 1357.33 1362.01 1383.83 1401.72 1404.35 1427.46 1456.26 1468.43 1469.70 1479.91 1486.47 1493.96 1533.45 1572.61 1584.08 1640.80 1676.22 1753.64 1766.33 1783.78 1815.07 2757.53 2762.09 3071.32 3084.34 3092.36 3103.49 3103.99 3116.93 3130.96 3147.07 3154.36 3156.47 3180.63 3507.92 3568.70 3572.47 3585.70 3792.52
formula: C10H18N3O6S
InChI: InChI=1S/C10H18N3O6S/c11-5(10(18)19)1-2-7(14)13-6(4-20)9(17)12-3-8(15)16/h5-6,12-13,15,18,20H,1-4H2,11H3
38 atoms
N  0.250084 2.532222 1.667018
H  1.10934 2.343484 1.168132
C  0.205702 3.397948 2.815758
H  1.209547 3.770279 3.028811
C  -0.282919 2.670609 4.052943
O  -0.044104 1.505107 4.316965
C  -0.917849 2.027715 1.200005
C  -0.810391 1.235499 -0.112923
O  -1.973329 2.217705 1.776824
N  -0.045762 0.009302 0.04925
H  -0.271407 1.865889 -0.825782
C  -2.192565 0.910452 -0.678146
H  -0.600064 -0.821211 0.206737
H  -2.815572 1.801115 -0.651768
H  -2.089814 0.59468 -1.716662
O  -0.966468 3.451269 4.865945
H  -1.226008 2.94358 5.647878
H  -0.450104 4.252611 2.646782
S  -3.042064 -0.451168 0.158626
H  -3.2099 0.179686 1.326524
C  1.296023 -0.038993 0.041287
O  2.011682 0.953267 0.008999
C  1.915695 -1.434552 0.029644
H  1.146889 -2.203492 0.153321
H  2.32437 -1.560476 -0.974823
C  3.055954 -1.561493 1.045519
H  3.552204 -0.593863 1.130974
H  3.810682 -2.272831 0.699871
C  2.60388 -1.985195 2.442998
H  3.434205 -1.938879 3.145778
N  2.062781 -3.39592 2.434924
H  1.03758 -3.259262 2.59413
H  2.230006 -3.875473 1.552607
C  1.42333 -1.15378 2.967001
O  0.326083 -1.673601 3.048237
O  1.756076 0.061109 3.249455
H  0.975059 0.61753 3.600937
H  2.439383 -3.963939 3.191212
totalener: -1406.24382504 hartree
nucrepener: 1944.12516299 hartree
electener: -3350.36898803 hartree
oneelecener: -5773.19503881 hartree
twoeener: 2422.82605078 hartree
kineticenergy: 1400.64214607 hartree
exchangeener: -105.327265570465 hartree
correlationener: -7.059790907628 hartree
xcener: -112.387056478093 hartree
temp: 298.15 k
press: 1.00 atm
thermalcorrenthalpy: 0.00094421 hartree
totalenthalpy: -1405.99882491 hartree
totalentropycorr: -0.06443659 hartree
gibbsenthalpy: -1406.06326150 hartree
gibbsminuselec: 0.26269618 hartree
chargesum: 1.0000000
charge: -0.234799 0.209702 -0.092529 0.137896 0.363798 -0.340184 0.254831 0.018218 -0.382038 -0.150280 0.137567 -0.163049 0.156435 0.136753 0.136452 -0.222758 0.244391 0.142994 -0.179239 0.137526 0.220515 -0.405335 -0.159834 0.076763 0.138913 -0.194553 0.143710 0.128816 -0.021782 0.172892 -0.062194 0.232169 0.225930 0.296119 -0.326930 -0.282557 0.266155 0.239516
charge: 0.329192 -0.042515 -0.042067 0.042503 -0.391275 0.190337 -0.375862 -0.126341 0.099481 0.341920 0.043186 -0.226511 -0.050721 0.016730 0.012741 0.416478 -0.068794 0.042487 0.489913 -0.140468 -0.396664 0.081937 -0.007416 0.016700 0.046613 -0.002777 0.050411 0.030054 -0.036925 0.043039 0.611230 0.015138 0.045258 -0.467446 0.128489 0.397530 -0.166476 0.050892
qa: -0.2348 0.2097 -0.0925 0.1379 0.3638 -0.3402 0.2548 0.0182 -0.3820 -0.1503 0.1376 -0.1630 0.1564 0.1368 0.1365 -0.2228 0.2444 0.1430 -0.1792 0.1375 0.2205 -0.4053 -0.1598 0.0768 0.1389 -0.1946 0.1437 0.1288 -0.0218 0.1729 -0.0622 0.2322 0.2259 0.2961 -0.3269 -0.2826 0.2662 0.2395
va: 3.1489 1.0297 3.8936 0.9991 4.1700 2.1492 4.2170 3.8344 2.1329 3.1452 1.0090 3.9434 1.0840 1.0120 1.0008 2.3064 1.0142 1.0158 2.1771 1.0272 4.2356 2.1104 3.8879 1.0218 1.0044 3.8256 1.0315 0.9994 3.8915 0.9934 3.5987 1.0370 0.9817 4.3365 2.1674 2.2650 1.0910 0.9723
dispcorr: -0.081846304 hartree
energy: -1406.332506456953
dipole: 9.72549 -6.35330 3.37219 -8.73581 4.86726 -3.86855 -4.64129 5.49414 0.85284
magnitude: 5.20237 au
magnitude: 13.22337 debye
zeropoint: 0.31057848 hartree
thermalvibcorrection: 0.01789979 hartree
thermalrotcorrection: 0.00141627 hartree
thermaltrasncorrection: 0.00141627 hartree
thermaltotal: -1406.00119565 hartree
thermalcorr: 0.02073233 hartree
nonthermalcorr: 0.31057848 hartree
totalcorr: 0.33131081 hartree
totalenthalpy: -1406.00025144 hartree
