program: Orca
programVersion: 5.0.2
elementType: N H C H C O C C O N H C H H H O H H S H C O C H H C H H C H N H H C O O H H
charge: 1
multiplicity: 1
keywords: wB97X-D3BJ Opt Freq def2-TZVPP def2/J RIJCOSX VeryTightSCF
keywords: PAL8 defgrid3 TightOpt
frequency: 0.00 0.00 0.00 0.00 0.00 0.00 19.78 26.31 37.16 42.77 53.45 64.10 88.60 98.59 113.15 141.48 151.39 185.34 199.75 223.39 226.17 253.94 270.34 282.14 299.82 308.53 321.85 342.33 377.87 387.30 402.72 441.90 482.78 506.74 511.43 543.51 570.96 580.25 590.05 628.60 650.92 684.95 723.77 726.18 729.79 740.75 766.40 811.18 827.65 854.20 860.28 880.14 905.49 924.50 972.99 1001.89 1014.30 1051.13 1060.45 1084.38 1111.82 1119.31 1125.47 1158.14 1173.90 1205.00 1212.07 1219.26 1233.86 1296.07 1298.63 1307.47 1308.46 1321.64 1337.13 1360.03 1369.63 1375.64 1395.22 1402.43 1404.79 1429.68 1451.59 1463.94 1489.43 1493.42 1502.46 1521.99 1578.92 1621.07 1628.20 1668.95 1721.85 1758.70 1852.60 1882.96 2745.43 3089.01 3097.30 3100.53 3103.76 3111.92 3124.44 3136.98 3151.22 3159.54 3179.83 3183.32 3370.28 3494.51 3516.31 3679.32 3786.53 3788.63
frequency: 19.78 26.31 37.16 42.77 53.45 64.10 88.60 98.59 113.15 141.48 151.39 185.34 199.75 223.39 226.17 253.94 270.34 282.14 299.82 308.53 321.85 342.33 377.87 387.30 402.72 441.90 482.78 506.74 511.43 543.51 570.96 580.25 590.05 628.60 650.92 684.95 723.77 726.18 729.79 740.75 766.40 811.18 827.65 854.20 860.28 880.14 905.49 924.50 972.99 1001.89 1014.30 1051.13 1060.45 1084.38 1111.82 1119.31 1125.47 1158.14 1173.90 1205.00 1212.07 1219.26 1233.86 1296.07 1298.63 1307.47 1308.46 1321.64 1337.13 1360.03 1369.63 1375.64 1395.22 1402.43 1404.79 1429.68 1451.59 1463.94 1489.43 1493.42 1502.46 1521.99 1578.92 1621.07 1628.20 1668.95 1721.85 1758.70 1852.60 1882.96 2745.43 3089.01 3097.30 3100.53 3103.76 3111.92 3124.44 3136.98 3151.22 3159.54 3179.83 3183.32 3370.28 3494.51 3516.31 3679.32 3786.53 3788.63
formula: C10H18N3O6S
InChI: InChI=1S/C10H18N3O6S/c11-5(10(18)19)1-2-7(14)13-6(4-20)9(17)12-3-8(15)16/h5-6,12-13,15,18,20H,1-4H2,11H3
38 atoms
N  -0.569273 2.909012 -2.218274
H  -1.096452 3.491393 -1.578054
C  -0.219568 3.424447 -3.523934
H  -0.197522 2.601146 -4.24037
C  1.125539 4.129382 -3.596318
O  1.360174 5.031544 -4.34395
C  -0.234473 1.680026 -1.826903
C  -0.702551 1.239478 -0.418498
O  0.37566 0.894419 -2.556626
N  0.001811 0.018726 -0.060841
H  -1.756482 0.968151 -0.519227
C  -0.578935 2.296404 0.693391
H  -0.479561 -0.85137 -0.208347
H  -0.665525 1.788625 1.652237
H  0.401548 2.767268 0.661287
O  2.055761 3.614701 -2.750531
H  2.83632 4.177545 -2.85055
H  -0.971275 4.13994 -3.850351
S  -1.780526 3.646063 0.621129
H  -2.887968 2.904249 0.75094
C  1.352163 -0.011687 -0.037648
O  2.022965 1.016864 0.005611
C  2.004532 -1.37082 -0.164076
H  2.890355 -1.381201 0.472592
H  1.333971 -2.15993 0.179937
C  2.390408 -1.661746 -1.625997
H  1.512046 -1.590229 -2.272784
H  2.751012 -2.688023 -1.68416
C  3.504222 -0.775143 -2.190092
H  4.346037 -0.751791 -1.492571
N  3.076683 0.635912 -2.41734
H  2.080437 0.700855 -2.712221
H  3.097967 1.157063 -1.532454
C  4.054607 -1.261563 -3.529987
O  4.224883 -0.520521 -4.461528
O  4.348122 -2.555957 -3.512779
H  4.72973 -2.801483 -4.368096
H  3.65915 1.053141 -3.145133
totalener: -1406.25485419 hartree
nucrepener: 1882.83006245 hartree
electener: -3289.08491664 hartree
oneelecener: -5649.34704249 hartree
twoeener: 2360.26212585 hartree
kineticenergy: 1400.67776918 hartree
exchangeener: -105.329311415706 hartree
correlationener: -7.055650054147 hartree
xcener: -112.384961469852 hartree
temp: 298.15 k
press: 1.00 atm
thermalcorrenthalpy: 0.00094421 hartree
totalenthalpy: -1406.00629494 hartree
totalentropycorr: -0.06512070 hartree
gibbsenthalpy: -1406.07141563 hartree
gibbsminuselec: 0.26446696 hartree
chargesum: 1.0000000
charge: -0.170473 0.181333 -0.086205 0.129633 0.274130 -0.257224 0.308578 0.057980 -0.475870 -0.173349 0.126768 -0.185990 0.180299 0.135549 0.151993 -0.302157 0.233042 0.156186 -0.119831 0.108017 0.230698 -0.425935 -0.161349 0.123113 0.115390 -0.194264 0.120507 0.142688 0.008807 0.138086 -0.044732 0.226860 0.228113 0.298450 -0.299400 -0.247336 0.254296 0.213599
charge: 0.349478 -0.068082 -0.027072 0.040993 -0.427816 0.150641 -0.354326 -0.121165 0.082597 0.347885 0.039343 -0.234318 -0.014836 0.012408 0.013416 0.331733 -0.088825 0.043805 0.534992 -0.144190 -0.369875 0.088859 -0.000075 0.040338 0.034357 0.002482 0.033670 0.041176 -0.048586 0.049021 0.606213 -0.016971 0.005870 -0.430690 0.135740 0.397956 -0.064323 0.028179
qa: -0.1705 0.1813 -0.0862 0.1296 0.2741 -0.2572 0.3086 0.0580 -0.4759 -0.1733 0.1268 -0.1860 0.1803 0.1355 0.1520 -0.3022 0.2330 0.1562 -0.1198 0.1080 0.2307 -0.4259 -0.1613 0.1231 0.1154 -0.1943 0.1205 0.1427 0.0088 0.1381 -0.0447 0.2269 0.2281 0.2984 -0.2994 -0.2473 0.2543 0.2136
va: 3.1975 1.0793 3.7976 1.0159 4.3015 2.2463 4.1581 3.8662 2.0224 3.2000 1.0004 3.9157 1.0137 1.0056 1.0121 2.1269 1.0206 1.0045 2.2209 1.0211 4.2048 2.0622 3.8342 1.0242 1.0119 3.8503 1.0210 1.0211 3.8582 1.0094 3.5875 1.0687 1.0267 4.3511 2.1910 2.2613 1.0059 1.0143
dispcorr: -0.081248105 hartree
energy: -1406.341555574030
dipole: -0.51648 0.91012 0.39364 -8.87947 6.30665 -2.57283 4.84552 -4.18245 0.66307
magnitude: 2.68590 au
magnitude: 6.82701 debye
zeropoint: 0.31134904 hartree
thermalvibcorrection: 0.01827157 hartree
thermalrotcorrection: 0.00141627 hartree
thermaltrasncorrection: 0.00141627 hartree
thermaltotal: -1406.00910242 hartree
thermalcorr: 0.02110411 hartree
nonthermalcorr: 0.31134904 hartree
totalcorr: 0.33245315 hartree
totalenthalpy: -1406.00815821 hartree
