program: Orca
programVersion: 5.0.2
elementType: N H C H C O C C O N H C H H H O H H S H C O C H H C H H C H N H H C O O H H
charge: 1
multiplicity: 1
keywords: wB97X-D3BJ Opt Freq def2-TZVPP def2/J RIJCOSX VeryTightSCF
keywords: PAL8 defgrid3 TightOpt
frequency: 0.00 0.00 0.00 0.00 0.00 0.00 17.72 35.26 41.39 51.50 69.11 77.47 94.86 104.56 118.82 124.86 153.50 173.58 211.62 219.18 250.15 256.58 280.06 281.13 302.32 312.89 326.39 337.64 353.20 371.60 418.66 492.37 498.25 513.21 520.02 536.50 565.85 572.10 611.65 632.08 663.08 680.53 691.85 702.10 727.35 746.92 790.57 796.21 815.18 832.64 860.62 892.98 907.24 910.01 941.51 972.83 1020.02 1038.92 1047.85 1086.42 1090.59 1114.89 1134.58 1151.67 1162.33 1198.26 1226.33 1252.21 1266.26 1282.33 1289.85 1297.68 1311.54 1324.29 1354.33 1366.63 1373.65 1383.09 1398.49 1399.59 1416.63 1424.79 1439.93 1460.25 1468.08 1486.03 1501.99 1543.83 1595.94 1611.81 1631.02 1668.90 1732.29 1758.63 1865.95 1884.26 2759.72 3037.20 3055.78 3097.61 3108.31 3123.20 3123.99 3129.25 3158.02 3173.63 3177.93 3197.51 3325.63 3447.19 3561.64 3647.02 3678.41 3791.57
frequency: 17.72 35.26 41.39 51.50 69.11 77.47 94.86 104.56 118.82 124.86 153.50 173.58 211.62 219.18 250.15 256.58 280.06 281.13 302.32 312.89 326.39 337.64 353.20 371.60 418.66 492.37 498.25 513.21 520.02 536.50 565.85 572.10 611.65 632.08 663.08 680.53 691.85 702.10 727.35 746.92 790.57 796.21 815.18 832.64 860.62 892.98 907.24 910.01 941.51 972.83 1020.02 1038.92 1047.85 1086.42 1090.59 1114.89 1134.58 1151.67 1162.33 1198.26 1226.33 1252.21 1266.26 1282.33 1289.85 1297.68 1311.54 1324.29 1354.33 1366.63 1373.65 1383.09 1398.49 1399.59 1416.63 1424.79 1439.93 1460.25 1468.08 1486.03 1501.99 1543.83 1595.94 1611.81 1631.02 1668.90 1732.29 1758.63 1865.95 1884.26 2759.72 3037.20 3055.78 3097.61 3108.31 3123.20 3123.99 3129.25 3158.02 3173.63 3177.93 3197.51 3325.63 3447.19 3561.64 3647.02 3678.41 3791.57
formula: C10H18N3O6S
InChI: InChI=1S/C10H18N3O6S/c11-5(10(18)19)1-2-7(14)13-6(4-20)9(17)12-3-8(15)16/h5-6,12-13,15,18,20H,1-4H2,11H3
38 atoms
N  -3.159591 1.616069 -0.692272
H  -3.283777 2.046346 0.207932
C  -4.201907 1.766862 -1.684735
H  -4.230781 0.883697 -2.32102
C  -4.061702 2.974354 -2.599473
O  -4.797566 3.179054 -3.518206
C  -1.974643 1.065597 -0.998967
C  -0.918737 1.144761 0.114602
O  -1.755993 0.560051 -2.093707
N  -0.007407 0.015447 -0.018858
H  -1.435347 1.038844 1.075532
C  -0.284359 2.54376 0.120853
H  -0.460212 -0.871415 -0.174708
H  -1.067212 3.259419 0.370212
H  0.474982 2.601028 0.894636
O  -3.045201 3.797832 -2.25613
H  -3.079745 4.545561 -2.869129
H  -5.167775 1.84854 -1.186345
S  0.508308 3.087177 -1.406278
H  -0.610801 3.371359 -2.081931
C  1.33564 -0.023667 0.017513
O  2.062035 0.970326 0.106979
C  1.955582 -1.403384 -0.123825
H  2.446753 -1.627425 0.82511
H  1.196766 -2.163055 -0.296976
C  3.006808 -1.452889 -1.248688
H  3.187841 -2.497473 -1.496974
H  3.957244 -1.043318 -0.8998
C  2.615108 -0.721573 -2.541333
H  3.179839 -1.117132 -3.38665
N  2.946087 0.747594 -2.433594
H  2.784604 1.052639 -1.446285
H  3.909013 0.939336 -2.698111
C  1.121643 -0.888382 -2.850493
O  0.557756 -1.926323 -2.650728
O  0.574026 0.232313 -3.30001
H  -0.386817 0.261188 -3.057999
H  2.30179 1.291536 -3.01406
totalener: -1406.23661383 hartree
nucrepener: 1945.96888133 hartree
electener: -3352.20549517 hartree
oneelecener: -5775.68468056 hartree
twoeener: 2423.47918540 hartree
kineticenergy: 1400.67396043 hartree
exchangeener: -105.331180163187 hartree
correlationener: -7.061292457644 hartree
xcener: -112.392472620831 hartree
temp: 298.15 k
press: 1.00 atm
thermalcorrenthalpy: 0.00094421 hartree
totalenthalpy: -1405.99320969 hartree
totalentropycorr: -0.06450928 hartree
gibbsenthalpy: -1406.05771897 hartree
gibbsminuselec: 0.26412927 hartree
chargesum: 1.0000000
charge: -0.175574 0.187440 -0.073247 0.144546 0.287284 -0.266115 0.255572 -0.015764 -0.417970 -0.135293 0.134474 -0.103894 0.191552 0.130680 0.151419 -0.294342 0.239722 0.141255 -0.189865 0.119192 0.207238 -0.426116 -0.161968 0.131817 0.126970 -0.230853 0.136087 0.123449 0.043890 0.165809 -0.078070 0.243660 0.224999 0.265891 -0.265123 -0.325047 0.282526 0.223767
charge: 0.348596 -0.014103 -0.026852 0.046303 -0.433801 0.148204 -0.370445 -0.121140 0.132824 0.361412 0.038465 -0.236476 -0.001615 0.012306 0.014176 0.341964 -0.082870 0.042848 0.493340 -0.154035 -0.369129 0.093581 0.001610 0.043883 0.028253 0.009737 0.044826 0.032588 -0.037909 0.043799 0.604752 -0.015451 0.040730 -0.461782 0.154452 0.365836 -0.140434 0.021560
qa: -0.1756 0.1874 -0.0732 0.1445 0.2873 -0.2661 0.2556 -0.0158 -0.4180 -0.1353 0.1345 -0.1039 0.1916 0.1307 0.1514 -0.2943 0.2397 0.1413 -0.1899 0.1192 0.2072 -0.4261 -0.1620 0.1318 0.1270 -0.2309 0.1361 0.1234 0.0439 0.1658 -0.0781 0.2437 0.2250 0.2659 -0.2651 -0.3250 0.2825 0.2238
va: 3.2364 1.0093 3.7893 1.0207 4.2937 2.2442 4.1917 3.9057 2.0737 3.2653 1.0022 3.8669 1.0084 1.0151 1.0168 2.1474 1.0150 1.0005 2.1414 1.0376 4.1984 2.0527 3.8280 1.0135 1.0201 3.9418 1.0078 1.0067 3.7275 0.9862 3.6308 1.0486 0.9787 4.4036 2.2416 2.1708 1.0461 1.0190
dispcorr: -0.085363522 hartree
energy: -1406.327757608399
dipole: 9.01077 -6.54870 2.46207 -4.36024 3.98094 -0.37930 5.55959 -4.48630 1.07329
magnitude: 2.71249 au
magnitude: 6.89461 debye
zeropoint: 0.31100053 hartree
thermalvibcorrection: 0.01810633 hartree
thermalrotcorrection: 0.00141627 hartree
thermaltrasncorrection: 0.00141627 hartree
thermaltotal: -1405.99581821 hartree
thermalcorr: 0.02093887 hartree
nonthermalcorr: 0.31100053 hartree
totalcorr: 0.33193939 hartree
totalenthalpy: -1405.99487401 hartree
